program: Gaussian 16
title: Title Card Required
version: ES64L-G16RevA.03
frameworkgroup: C1[X(C14H19O5)]
method: RM062X
basis: 6-311G(d,p)
operation: Freq
keyword: #P
keyword: Geom=AllCheck
keyword: Guess=TCheck
keyword: SCRF=Check
keyword: GenChk
keyword: RM062X/6-311G(d,p)
keyword: Freq
converged: YES YES NO YES
title: Mulliken charges:
elementType: C C C C C C C C O C C O C H H O H H H C H H O H H H H H C H H H O C H H H H
charge: -0.118647 -0.146261 0.187174 -0.132845 -0.154424 -0.193650 -0.281927 -0.099241 -0.372877 -0.055799 0.209572 -0.397873 0.488614 0.161476 0.164214 -0.374474 0.190844 0.222993 0.198299 -0.320048 0.230384 0.234318 -0.351646 0.171408 0.173844 0.168758 0.227388 0.175478 -0.231528 0.171002 0.155557 0.158463 -0.206169 -0.185695 0.188317 0.211496 0.210836 0.322668
chargesum: 1.00000
title: Mulliken charges with hydrogens summed into heavy atoms:
elementType: C C C C C C C C O C C O C O C O C O C
charge: 0.042829 0.017953 0.187174 0.057999 -0.154424 -0.018172 0.139366 -0.099241 -0.372877 0.408903 0.436959 -0.397873 0.488614 -0.374474 0.193962 -0.028977 0.253493 -0.206169 0.424954
polarizability: 2.37298307e+02 -2.65793062e+00 2.43566595e+02 -2.14065695e+01 8.88673448e+00 1.70101995e+02
1716.lowfreq: -44.4590 -7.3181 -0.0009 0.0006 0.0006 14.2734 19.1473 46.1275 63.3268
frequency: -42.6194 45.6865 63.2132 79.1056 89.8655 105.1181 111.2560 123.3466 156.3533 170.1782 200.4533 215.3085 235.8811 247.6125 273.0948 283.9431 301.3888 304.9185 323.5801 344.8909 385.4428 399.5737 415.8578 458.4752 471.9416 484.8171 509.7397 562.9790 567.5122 593.2072 607.0434 657.8036 674.4811 716.9656 756.6463 770.3044 807.6501 819.7475 829.4231 871.5967 904.8548 921.2014 939.4932 949.0643 980.6388 997.6092 1009.7709 1012.7916 1079.2627 1093.4558 1102.8365 1123.6691 1132.4888 1148.5839 1179.1758 1183.1002 1186.9629 1195.7017 1203.2817 1215.9893 1220.9225 1227.1758 1245.8066 1288.2082 1298.0608 1314.7616 1324.3938 1359.9710 1379.7724 1393.9338 1408.8749 1426.9488 1439.0006 1446.0591 1465.8072 1477.2960 1478.1214 1486.6799 1493.4755 1495.7978 1498.6127 1499.2865 1512.0336 1530.8687 1539.4610 1655.3607 1666.5497 1681.8170 1821.6250 3003.1014 3054.2465 3080.1350 3083.1246 3093.2087 3112.4223 3125.6469 3128.6410 3161.8585 3180.3495 3183.0430 3192.9516 3215.2215 3217.6460 3223.0689 3229.2625 3234.4978 3245.5875 3740.7547
redmass: 5.6373 4.1062 4.9051 6.0127 4.8666 2.9354 1.1585 3.8852 4.2479 4.1075 2.3296 2.7515 2.1746 2.6274 3.7595 1.4499 2.8993 1.7997 3.1374 3.7881 2.8050 4.2140 3.2798 3.0491 4.2869 4.1390 4.0922 4.3549 4.7403 4.0895 1.2440 4.9890 4.1335 2.9979 4.4098 3.7864 4.8209 1.5068 1.3610 1.5632 2.1803 1.9691 1.7192 2.3591 3.2066 2.5086 1.3764 3.9988 2.7538 3.9519 1.5423 1.6277 2.2045 1.8327 1.2583 2.3547 1.2800 1.3431 1.4780 1.5260 2.5706 1.6916 2.5866 1.8688 1.1091 3.3280 1.5269 1.6683 2.0397 1.4403 1.6219 1.7490 1.2099 1.1911 1.0449 1.3169 1.2623 1.1050 1.1500 1.2027 1.1275 1.0519 1.5130 1.1596 2.4792 6.6061 5.6069 4.7647 10.9580 1.0694 1.0340 1.0358 1.0616 1.0890 1.0273 1.1072 1.1040 1.1047 1.1035 1.1023 1.0903 1.0908 1.0946 1.1107 1.0970 1.1108 1.0903 1.0650
irintensity: 7.5290 2.3405 2.1585 1.2808 5.7765 7.1417 1.9229 3.6309 1.7388 4.0897 32.5186 4.9186 0.3954 5.8607 2.3343 1.0685 0.0899 0.6183 5.5579 0.3937 45.8969 28.1265 6.2529 12.7006 3.3304 22.0105 1.4040 1.6079 14.8636 23.7023 146.8567 21.8473 63.5692 26.9048 10.2892 88.8541 28.2154 38.0282 38.2066 28.5987 7.5689 14.8395 1.4083 11.1267 59.6280 29.6287 2.8672 2.2955 43.4767 76.5777 18.9457 8.1646 99.7225 57.2198 4.2662 15.6075 1.4486 26.6080 77.9572 68.0894 400.7935 17.0593 24.0173 9.7996 5.8210 277.0114 27.5869 31.0631 102.1635 20.5671 66.5351 60.2791 96.2667 99.1523 30.9038 38.3465 27.0066 11.0859 60.2243 24.0907 55.2666 15.9476 52.8583 46.4582 131.1421 43.2442 365.5388 313.2567 520.8779 36.2041 41.8416 7.7945 8.9972 6.3703 2.0853 32.1519 5.1785 13.9092 4.5445 17.6722 2.1075 3.6699 15.2051 3.5154 1.5173 0.4709 1.4911 284.4792
temp: 298.150 k
press: 1.00000 atm
elementType: 6 6 6 6 6 6 6 6 8 6 6 8 6 1 1 8 1 1 1 6 1 1 8 1 1 1 1 1 6 1 1 1 8 6 1 1 1 1
symmnumber: 1
zpe: 838449.4 jmol-1
zpe.correction: 0.319348 hartree
zpe.thermalcorrener: 0.337484 hartree
zpe.thermalcorrenthalpy: 0.338428 hartree
zpe.thermalcorrgfe: 0.273993 hartree
zpe.sumelectzpe: -920.388816 hartree
zpe.sumelectthermal: -920.370681 hartree
zpe.sumelectthermalent: -920.369737 hartree
zpe.sumelectthermalfe: -920.434172 hartree
dipole: -6.3568 5.2571 0.9005
dipole: 8.2980
quadrupole: -86.2929 -68.0974 -107.4068
quadrupole: -15.0424 -9.9712 1.0758
quadrupole: 0.9728 19.1683 -20.1411 -15.0424 -9.9712 1.0758
hfenergy: -920.7081645 hartree
pointgroup: C01 [X(C14H19O5)]
dipole: -2.5012378 2.0679634 0.3542818 debye
polarizability: 237.2990625|-2.658821|243.5658393|-21.4078317|8.8836933|170.1019949 unknown
InChI: InChI=1S/C14H19O5/c1-14(13(15)16,19-8-7-17-2)10-11-5-4-6-12(9-11)18-3/h4-7,9,15H,8,10H2,1-3H3
charge 1 multiplicity 1
38 atoms
C  1.88372996 1.96961987 1.21668195
C  2.93984074 1.43782323 0.50299157
C  2.90902169 0.08988127 0.11220521
C  1.80392842 -0.70146054 0.42111024
C  0.72279815 -0.14981239 1.11608155
C  0.772299 1.18030766 1.5288261
C  -0.5164548 -0.98075334 1.35546661
C  -1.22138479 -1.45872424 0.03170185
O  -0.6554546 -0.9382963 -1.16147781
C  -0.5953904 0.42581042 -1.4747619
C  -1.24632065 1.40873684 -0.57886333
O  -3.20026712 -0.21920776 -0.61178175
C  -2.70146858 -1.07934539 0.07521736
H  1.92044678 3.00385032 1.5388905
H  3.81025003 2.03026166 0.24759128
O  3.99282615 -0.34982719 -0.56044862
H  1.75741574 -1.73654351 0.10897463
H  -0.25596995 -1.87578086 1.9239963
H  -1.2150281 -0.41219629 1.97482289
C  -1.09581705 -2.97092307 -0.13185546
H  -1.02456697 0.57980231 -2.47034669
H  0.45857569 0.74795807 -1.52317496
O  -3.37639404 -1.78326315 0.97281421
H  -1.52355955 -3.4809719 0.73021231
H  -0.03754625 -3.22550241 -0.20907979
H  -1.60892357 -3.29635436 -1.03828834
H  -1.57046837 1.2311108 0.44312728
H  -0.04799406 1.59712237 2.10489306
C  4.00983052 -1.70839221 -0.97769258
H  4.95726556 -1.84991904 -1.49283252
H  3.18541971 -1.91823136 -1.6652299
H  3.95697549 -2.38333992 -0.1188581
O  -1.37861332 2.56114151 -1.04521222
C  -1.90761995 3.64399275 -0.21899943
H  -2.24514775 3.23934859 0.73251673
H  -1.09141036 4.35132468 -0.09623042
H  -2.72295428 4.07937222 -0.78908797
H  -4.3031331 -1.48682033 0.97780115
