program: Gaussian 16
title: Title Card Required
version: ES64L-G16RevA.03
frameworkgroup: C1[X(C13H15O4)]
method: RM062X
basis: 6-311G(d,p)
operation: Freq
keyword: #P
keyword: Geom=AllCheck
keyword: Guess=TCheck
keyword: SCRF=Check
keyword: GenChk
keyword: RM062X/6-311G(d,p)
keyword: Freq
converged: YES YES YES YES
title: Mulliken charges:
elementType: C C C C C C C C O C C O C H H H H C H H O H H H H H O C H H H H
charge: 0.255953 -0.173260 -0.105281 -0.126467 -0.083729 -0.301687 -0.225888 -0.125902 -0.370548 -0.028995 0.172049 -0.231416 0.525489 0.189539 0.164595 0.219503 0.224417 -0.322503 0.250334 0.228797 -0.243344 0.179218 0.182273 0.174636 0.273717 0.215307 -0.365929 -0.228207 0.160785 0.175068 0.167986 0.173489
chargesum: 1.00000
title: Mulliken charges with hydrogens summed into heavy atoms:
elementType: C C C C C C C C O C C O C C O O C
charge: 0.255953 0.016280 0.068208 0.038129 -0.083729 -0.086380 0.218032 -0.125902 -0.370548 0.450136 0.445766 -0.231416 0.525489 0.213624 -0.243344 -0.365929 0.275632
polarizability: 2.57360641e+02 9.35767245e+00 2.01333559e+02 1.29199111e+01 3.61276761e+00 1.54659403e+02
1716.lowfreq: -169.1189 -42.6124 -16.1615 -0.0007 -0.0001 0.0008 23.2602 57.5696 62.8431
frequency: -169.0075 56.2966 61.4629 99.2771 119.0097 148.5053 201.7468 218.9474 239.4727 251.4464 259.3170 277.7882 297.6825 307.3523 343.6239 359.1316 384.9635 459.8166 470.1669 472.7901 503.5362 548.6740 563.6764 590.4206 630.1640 675.4247 725.2228 748.4482 753.3112 770.4592 807.6098 832.4405 879.1244 898.3138 919.2234 931.5233 936.4064 955.3469 973.1580 1000.1456 1006.6011 1018.9111 1051.2741 1091.7005 1118.6977 1140.2783 1159.3511 1182.6517 1183.7311 1193.3290 1197.2469 1206.4224 1226.8454 1235.2758 1295.4667 1321.7348 1338.8921 1348.4367 1355.0381 1371.9763 1400.1438 1410.9480 1421.0908 1468.6747 1474.5423 1477.4426 1485.0939 1495.9093 1498.6267 1505.1677 1540.5481 1563.4915 1650.7680 1655.8998 1998.5882 2989.7893 3061.3225 3083.4058 3084.4770 3087.9654 3136.9680 3141.7877 3174.2415 3176.0103 3189.0575 3205.4571 3212.3047 3213.2835 3225.5743 3247.1997
redmass: 6.2711 4.8037 3.4188 5.1426 4.5692 6.4773 3.6939 3.5322 2.3086 2.2790 1.6377 2.0009 1.5000 3.5546 3.0238 2.5551 3.5604 4.1763 4.0838 4.5754 5.5672 5.9699 4.6887 4.7007 6.4442 4.9723 3.0573 2.0988 5.0704 3.6991 1.7936 1.9389 3.6087 1.6817 1.4897 2.1166 2.6850 2.0755 2.1020 2.0085 3.9077 1.3980 1.5881 2.9497 1.6628 1.9268 1.8549 1.2169 1.2168 2.3877 2.7894 1.8896 1.5231 1.3797 2.2674 1.7515 2.0762 2.9819 1.5794 1.7141 1.7734 1.2670 1.1124 1.3758 1.3021 1.0928 1.0672 1.5646 1.0728 1.0714 2.5490 3.8557 5.9976 6.4463 13.0349 1.0701 1.0333 1.0877 1.0364 1.0587 1.1082 1.1060 1.1044 1.1058 1.1035 1.0916 1.0967 1.0892 1.0957 1.0939
irintensity: 540.2386 6.8642 3.4581 1.6649 0.6824 7.3199 59.5224 10.4282 13.4497 42.4985 1.0940 4.6919 2.9836 9.4384 0.7169 8.6995 25.6563 0.5043 13.9428 8.2682 9.6633 24.3658 54.6818 11.8740 77.7804 51.5136 22.2238 39.8174 130.6329 101.2972 35.4563 40.4963 96.0419 309.6923 11.1701 39.8290 21.0093 33.1473 7.8951 193.0127 13.1568 0.9559 79.6736 94.0957 5.5446 13.7898 31.0227 18.0873 18.3976 59.9744 41.9581 28.0796 18.9774 87.0011 103.4141 221.3488 244.1976 149.5949 252.2826 11.7052 55.1793 10.2953 45.3643 61.2210 50.1643 30.8200 5.5642 20.6076 12.4605 13.7342 179.3470 392.5152 215.3189 94.1918 514.4498 44.1588 40.1307 24.3298 1.4361 6.9371 23.6151 0.4238 2.1348 5.2586 11.4783 4.9142 28.1103 2.5903 2.2470 0.9852
temp: 298.150 k
press: 1.00000 atm
elementType: 6 6 6 6 6 6 6 6 8 6 6 8 6 1 1 1 1 6 1 1 8 1 1 1 1 1 8 6 1 1 1 1
symmnumber: 1
zpe: 687799.3 jmol-1
zpe.correction: 0.261969 hartree
zpe.thermalcorrener: 0.276502 hartree
zpe.thermalcorrenthalpy: 0.277447 hartree
zpe.thermalcorrgfe: 0.221136 hartree
zpe.sumelectzpe: -804.703042 hartree
zpe.sumelectthermal: -804.688508 hartree
zpe.sumelectthermalent: -804.687564 hartree
zpe.sumelectthermalfe: -804.743875 hartree
dipole: 2.4592 0.5507 4.2562
dipole: 4.9463
quadrupole: -68.1687 -90.2949 -86.7424
quadrupole: -7.2466 6.5136 -5.7452
quadrupole: 13.5666 -8.5595 -5.0071 -7.2466 6.5136 -5.7452
hfenergy: -804.9650107 hartree
pointgroup: C01 [X(C13H15O4)]
dipole: -0.5841143 -1.3960913 -1.2234016 debye
polarizability: 233.9811611|35.113277|211.797359|5.7868819|-22.4136446|167.5750821 unknown
InChI: InChI=1S/C13H15O4/c1-13(12(14)16-6-7-17-13)9-10-4-3-5-11(8-10)15-2/h3-6,8H,7,9H2,1-2H3
charge 1 multiplicity 1
32 atoms
C  -1.75792673 -1.51391036 1.69345233
C  -2.7998405 -1.51258669 0.76531815
C  -2.98255662 -0.39119033 -0.04026545
C  -2.13143414 0.70804364 0.03296716
C  -1.07019126 0.70101306 0.93388892
C  -0.88470935 -0.41122365 1.76387889
C  -0.05763812 1.81506096 0.89916708
C  1.14915882 1.51452633 -0.04224435
O  0.79275797 0.74153075 -1.19138884
C  0.51669482 -0.62623203 -1.02520587
C  0.96714459 -1.1973612 0.24406654
O  1.89013166 -0.6492526 0.93759877
C  2.2189906 0.76338296 0.72707433
H  -3.47866419 -2.35033571 0.68338129
H  -2.27903427 1.56041179 -0.61955101
H  -0.53000246 2.71779176 0.50836357
H  0.32397446 2.04342827 1.89788818
C  1.75090236 2.80471999 -0.56582783
H  1.09776543 -1.20232569 -1.76908128
H  -0.53739261 -0.87265673 -1.19315031
O  3.21540274 1.12554164 1.22125228
H  1.99815865 3.46628113 0.26514716
H  1.00785622 3.28942226 -1.19955778
H  2.64895374 2.60105813 -1.14921992
H  0.72767927 -2.2239737 0.51537132
H  -0.13204674 -0.41265794 2.54543738
O  -1.49009847 -2.516252 2.5442979
C  -2.34259348 -3.65963865 2.52520069
H  -2.31192415 -4.15137964 1.5496841
H  -1.95223416 -4.33101228 3.28604295
H  -3.37002275 -3.38089647 2.77152346
H  -3.80536181 -0.38380215 -0.74580467
