program: Gaussian 16
title: Title Card Required
version: ES64L-G16RevA.03
frameworkgroup: C1[X(C14H19O5)]
method: RM062X
basis: 6-311G(d,p)
operation: Freq
keyword: #P
keyword: Geom=AllCheck
keyword: Guess=TCheck
keyword: SCRF=Check
keyword: GenChk
keyword: RM062X/6-311G(d,p)
keyword: Freq
converged: YES YES NO YES
title: Mulliken charges:
elementType: C C C C C C C C O C C O C H H O H H H C H H O H H H H H C H H H O C H H H H
charge: -0.147543 -0.146882 0.174844 -0.143276 -0.140483 -0.101168 -0.272898 -0.077994 -0.368694 -0.135423 0.234034 -0.331380 0.593998 0.156407 0.159610 -0.380278 0.177334 0.206397 0.209648 -0.309449 0.202120 0.217561 -0.293657 0.183768 0.195156 0.179508 0.229493 0.144031 -0.228827 0.168745 0.152398 0.154577 -0.329228 -0.201312 0.175509 0.165901 0.168740 0.358710
chargesum: 1.00000
title: Mulliken charges with hydrogens summed into heavy atoms:
elementType: C C C C C C C C O C C O C O C O C O C
charge: 0.008865 0.012728 0.174844 0.034058 -0.140483 0.042863 0.143146 -0.077994 -0.368694 0.284259 0.463527 -0.331380 0.593998 -0.380278 0.248983 0.065053 0.246894 -0.329228 0.308837
polarizability: 2.59396478e+02 9.82636681e+00 2.27375213e+02 1.78555755e+01 8.89140413e-01 1.48459338e+02
1716.lowfreq: -13.5906 -9.3841 -0.0006 0.0004 0.0007 12.0440 29.2019 49.3135 60.6977
frequency: 28.0478 42.2775 60.3437 73.8597 105.8296 110.8575 128.6766 165.7827 168.6040 181.0594 209.2986 222.6421 246.1651 249.7109 271.8191 301.8625 303.8826 309.9699 362.9110 386.4248 411.7902 448.9316 463.3142 470.9316 496.3584 528.6947 548.9646 566.2480 581.3679 606.9160 632.4749 635.6389 706.1959 729.9873 750.8569 787.4613 799.6986 819.8859 884.8690 900.9821 923.1779 938.0424 967.2521 975.2404 1003.2780 1007.0938 1011.8735 1043.5185 1091.4793 1095.7213 1118.0161 1126.6844 1162.7806 1172.6877 1175.0792 1186.8414 1189.5652 1203.1431 1216.1444 1218.3035 1228.4761 1239.1849 1277.3217 1290.0414 1305.1568 1314.8126 1334.3712 1356.2607 1364.5767 1370.1415 1387.2351 1401.5173 1468.2803 1470.2441 1473.9679 1477.6085 1483.8682 1496.9954 1498.5218 1500.6624 1502.8822 1510.1207 1521.6131 1523.5529 1542.0214 1553.6034 1643.8647 1665.2767 1672.2064 3049.2548 3078.9968 3080.7025 3083.9223 3099.2866 3118.3728 3145.7152 3147.2071 3163.1383 3167.4613 3173.9431 3175.9881 3179.5802 3204.6827 3207.7705 3220.9079 3225.8821 3229.1236 3655.3291
redmass: 4.7311 4.5079 4.1081 4.6286 3.3486 3.7365 3.7370 1.8361 3.9172 2.0751 1.5146 1.8793 2.5683 3.2487 2.7922 3.6025 1.5780 3.2365 3.6452 2.3866 3.3931 3.5513 3.7356 3.7115 4.2820 4.4250 5.3783 4.8489 4.2715 3.0989 1.3479 3.8253 2.7690 4.3310 3.1248 4.9493 3.8779 1.5980 1.9190 1.5085 1.4165 1.9987 2.3492 2.2120 2.0449 1.3041 5.8211 4.9998 4.0490 2.0119 1.7580 2.4365 3.5155 1.2759 1.8666 1.2791 1.2845 2.2698 1.8279 1.4925 1.8060 1.7058 1.7972 1.9412 1.5218 2.5642 1.4746 1.5745 2.0272 1.7751 1.2334 1.2329 1.1434 1.3203 1.1071 1.5481 1.0813 1.0430 1.0455 1.2734 1.0587 1.3900 1.1046 1.6134 2.5623 3.9651 7.9116 6.7930 5.9363 1.0344 1.0322 1.0622 1.0364 1.0621 1.1073 1.1035 1.0898 1.1088 1.1036 1.1048 1.1050 1.1015 1.1060 1.0879 1.0931 1.0914 1.0970 1.0654
irintensity: 0.0595 0.2810 1.0167 0.5467 8.0027 1.6032 4.9018 2.4575 1.0787 0.9908 3.0240 0.4342 3.5835 2.6346 5.1200 65.8380 10.3701 15.0441 46.0933 38.3112 2.5341 33.4062 7.1346 9.4792 14.5077 20.1951 8.0710 9.2150 0.6646 170.9887 146.4779 36.4661 37.1625 31.6688 1.3288 69.5749 263.8301 54.6025 18.4365 43.6141 1.9434 19.8673 12.8696 14.1229 69.4889 0.1576 5.7278 82.0137 57.0228 4.2607 28.1733 29.8697 197.7793 12.9617 30.8432 1.4599 4.1434 87.0453 89.0778 74.4946 41.8917 159.1671 13.4998 381.3047 15.8183 265.1744 14.2569 62.4774 45.6248 61.9666 11.4427 19.7182 25.0574 12.2644 13.9853 41.9754 14.7820 22.4882 17.2622 19.2999 33.1092 61.1134 28.1654 70.4988 118.7657 266.1557 731.3350 32.4290 170.5354 43.1653 22.7801 8.4810 0.6399 11.5497 35.9226 2.5050 7.8351 16.3474 7.1207 1.2219 2.2713 20.4944 6.6190 5.5248 3.5050 1.2188 3.7191 466.1762
temp: 298.150 k
press: 1.00000 atm
elementType: 6 6 6 6 6 6 6 6 8 6 6 8 6 1 1 8 1 1 1 6 1 1 8 1 1 1 1 1 6 1 1 1 8 6 1 1 1 1
symmnumber: 1
zpe: 842225.9 jmol-1
zpe.correction: 0.320787 hartree
zpe.thermalcorrener: 0.339186 hartree
zpe.thermalcorrenthalpy: 0.340130 hartree
zpe.thermalcorrgfe: 0.274055 hartree
zpe.sumelectzpe: -920.409277 hartree
zpe.sumelectthermal: -920.390877 hartree
zpe.sumelectthermalent: -920.389933 hartree
zpe.sumelectthermalfe: -920.456009 hartree
dipole: -13.0063 4.8796 -1.3755
dipole: 13.9595
quadrupole: -53.9781 -85.4484 -107.0962
quadrupole: 5.2324 9.3435 -2.2122
quadrupole: 28.1961 -3.2742 -24.9219 5.2324 9.3435 -2.2122
hfenergy: -920.7300637 hartree
pointgroup: C01 [X(C14H19O5)]
dipole: 5.1009465 -1.9377166 -0.6232493 debye
polarizability: 259.2933595|10.0846832|227.2396525|-18.3075847|1.1814011|148.6980176 unknown
InChI: InChI=1S/C14H19O5/c1-14(13(15)19-12(17-3)9-18-14)8-10-5-4-6-11(7-10)16-2/h4-7,12,15H,8-9H2,1-3H3
charge 1 multiplicity 1
38 atoms
C  -2.78510461 2.37409611 -0.29352664
C  -3.91033807 1.65683144 0.07676331
C  -3.87718603 0.25862816 0.07100168
C  -2.70877337 -0.40610394 -0.30256727
C  -1.57557023 0.32660628 -0.67246489
C  -1.6142489 1.7176171 -0.67082143
C  -0.31800304 -0.408909 -1.06783832
C  0.72146753 -0.45233714 0.07873569
O  1.13860257 0.87836291 0.30333332
C  2.3723276 1.01419082 0.97608977
C  3.47494688 0.6172074 0.03417825
O  3.07411687 -0.82022604 -0.50419904
C  1.90151726 -1.25923695 -0.41301126
H  -2.82016213 3.45747487 -0.29314761
H  -4.82937019 2.15197254 0.36713201
O  -5.02250825 -0.36358996 0.43772801
H  -2.66691489 -1.48833878 -0.31995785
H  -0.55870275 -1.43472453 -1.35026932
H  0.15638423 0.08183105 -1.92183876
C  0.17079706 -1.10886044 1.34879012
H  2.43064741 0.41082164 1.88660743
H  2.49307725 2.06577865 1.23321445
O  1.66541987 -2.47598898 -0.74987821
H  -0.26322456 -2.08234199 1.11674004
H  -0.60603894 -0.45505875 1.74522794
H  0.94533943 -1.24258345 2.10511812
H  3.50537284 1.17787493 -0.90175178
H  -0.73579104 2.28148971 -0.95914533
C  -5.04077043 -1.78262341 0.42019523
H  -6.04062104 -2.07295037 0.73567318
H  -4.30595313 -2.19659044 1.11707941
H  -4.85183521 -2.16761111 -0.58638074
O  4.63818717 0.4631941 0.65211244
C  5.7895458 0.38643351 -0.20732712
H  6.65526183 0.36233239 0.44858887
H  5.74929047 -0.52508621 -0.80485675
H  5.82979831 1.26610077 -0.85250867
H  2.47544444 -2.94396614 -1.03982882
