program: Gaussian 16
title: Title Card Required
version: ES64L-G16RevA.03
frameworkgroup: C1[X(C13H15O4)]
method: RM062X
basis: 6-311G(d,p)
operation: Freq
keyword: #P
keyword: Geom=AllCheck
keyword: Guess=TCheck
keyword: SCRF=Check
keyword: GenChk
keyword: RM062X/6-311G(d,p)
keyword: Freq
converged: YES YES YES YES
title: Mulliken charges:
elementType: C C C C C C C C O C C O C H H H H C H H O H H H H H O C H H H H
charge: 0.319523 -0.131786 -0.031985 -0.051184 -0.031256 -0.222250 -0.251664 -0.109879 -0.393995 -0.011212 -0.093513 -0.315179 0.479872 0.210680 0.180239 0.209867 0.228220 -0.310978 0.191507 0.188084 -0.346021 0.162762 0.164948 0.163888 0.232516 0.310017 -0.308094 -0.223593 0.192621 0.196971 0.193912 0.206960
chargesum: 1.00000
title: Mulliken charges with hydrogens summed into heavy atoms:
elementType: C C C C C C C C O C C O C C O O C
charge: 0.319523 0.078893 0.174974 0.129055 -0.031256 0.087767 0.186423 -0.109879 -0.393995 0.368379 0.139003 -0.315179 0.479872 0.180620 -0.346021 -0.308094 0.359912
polarizability: 2.45297315e+02 -9.26038838e+00 2.04477985e+02 1.79814369e+01 -1.53254738e+00 1.30060975e+02
1716.lowfreq: -33.7574 -9.4515 -0.0009 -0.0006 0.0005 14.5691 36.0946 57.9139 119.4108
frequency: 30.9283 56.4079 119.3420 138.2367 168.5949 192.2739 220.5050 238.9565 247.5588 259.3035 277.7509 323.3187 326.3466 339.8907 365.3210 421.8850 437.9566 451.6662 466.4515 526.7523 545.5239 565.1260 597.0037 644.7663 683.9954 730.6691 786.5396 792.4724 836.2467 838.4892 855.7451 870.0787 920.5565 932.5094 954.4863 970.1622 975.9594 1017.8609 1048.9212 1062.7527 1077.3845 1097.4161 1109.6599 1130.8834 1146.9111 1165.8740 1182.8617 1185.5006 1195.1426 1197.7348 1206.8895 1216.2942 1231.6119 1283.3588 1293.7597 1318.2494 1335.7541 1367.9946 1385.4712 1414.3459 1418.3584 1428.3431 1432.6945 1449.9552 1453.7621 1473.6535 1477.9913 1485.8435 1489.3807 1499.7504 1508.3332 1532.6168 1603.4511 1690.5114 1889.2098 2996.2666 3062.5369 3068.5221 3083.9343 3093.8018 3131.9509 3142.0497 3169.6621 3171.0074 3173.4120 3186.0224 3217.1221 3227.1917 3235.2999 3263.0331
redmass: 4.6692 5.0010 3.7051 4.7798 3.4912 3.1575 2.5986 1.7034 2.7897 2.4905 1.1436 3.3734 4.2657 2.4830 3.5254 5.3026 3.1986 4.7123 6.3279 5.8792 4.4191 4.3001 4.2039 4.8055 4.4914 4.8998 4.8373 3.7558 3.1048 1.6349 3.7236 2.5970 2.4370 1.6455 2.1952 2.8255 2.0338 2.5790 2.8082 1.4176 2.0897 1.8629 2.2229 1.8905 2.8991 1.9127 1.9504 1.5254 2.0388 1.3969 4.5747 1.3573 1.6386 1.5208 1.1671 2.3692 1.9681 1.8171 1.9084 1.3570 1.9393 1.4234 1.6367 1.6377 1.3986 1.7119 1.0672 1.0691 1.1868 1.0497 1.0927 2.0356 4.4530 6.6419 12.8968 1.0775 1.0673 1.0622 1.0347 1.0310 1.1062 1.0981 1.1048 1.0883 1.1040 1.1104 1.0919 1.1065 1.0949 1.0948
irintensity: 0.3606 0.6345 6.6298 6.3954 1.7301 3.0357 19.1091 1.9201 3.4648 5.2077 2.0267 12.0196 12.7412 1.3831 5.3975 4.2320 9.8452 13.7383 0.4648 2.0999 14.6723 12.5341 36.4671 30.8318 10.7215 7.9560 26.3839 22.8966 3.3372 64.7182 22.9916 6.5877 9.6416 18.2797 16.4515 36.9424 16.4242 67.5822 46.2897 4.3830 89.4449 12.8034 122.6301 48.7723 117.7579 38.5320 119.8315 64.4321 38.0050 21.8345 535.4453 0.0267 51.8658 3.9454 52.1141 45.6488 379.8799 27.4667 160.2849 10.4869 34.0527 47.4589 240.5924 70.6475 302.1784 241.9800 15.4684 7.1373 22.5868 31.9944 6.4484 733.2663 97.5187 372.2988 601.7982 47.8811 0.5479 33.9741 6.9540 14.9353 11.3189 3.2860 10.4595 0.5918 7.7724 3.3885 0.8547 2.3983 1.1796 13.2352
temp: 298.150 k
press: 1.00000 atm
elementType: 6 6 6 6 6 6 6 6 8 6 6 8 6 1 1 1 1 6 1 1 8 1 1 1 1 1 8 6 1 1 1 1
symmnumber: 1
zpe: 698846.9 jmol-1
zpe.correction: 0.266177 hartree
zpe.thermalcorrener: 0.280502 hartree
zpe.thermalcorrenthalpy: 0.281446 hartree
zpe.thermalcorrgfe: 0.225183 hartree
zpe.sumelectzpe: -804.732408 hartree
zpe.sumelectthermal: -804.718083 hartree
zpe.sumelectthermalent: -804.717139 hartree
zpe.sumelectthermalfe: -804.773402 hartree
dipole: 12.9352 4.4430 0.6818
dipole: 13.6940
quadrupole: -59.9317 -81.2706 -95.5546
quadrupole: -9.8876 -1.0927 -7.9964
quadrupole: 18.9873 -2.3517 -16.6356 -9.8876 -1.0927 -7.9964
hfenergy: -804.9985851 hartree
pointgroup: C01 [X(C13H15O4)]
dipole: 4.9974121 2.0018171 0.2122178 debye
polarizability: 243.6528615|-3.5408392|201.4808756|25.1081356|-12.8218881|134.7025382 unknown
InChI: InChI=1S/C13H15O4/c1-13-6-8-4-3-5-9(15-2)11(8)10(7-16-13)17-12(13)14/h3-5,10-11H,6-7H2,1-2H3
charge 1 multiplicity 1
32 atoms
C  2.21924227 -0.04636295 -0.09224322
C  2.8631121 1.18883673 -0.035498
C  2.12340171 2.31725977 -0.31246594
C  0.74304374 2.29843546 -0.65322567
C  0.07312753 1.12515238 -0.73664056
C  0.7846011 -0.166323 -0.4918842
C  -1.38712153 1.08324056 -1.06962288
C  -2.20220401 0.29042555 -0.00843925
O  -1.60423799 0.48284223 1.27429499
C  -0.61242654 -0.46190767 1.65288973
C  0.00786487 -1.13971858 0.44858325
O  -1.01688575 -1.82228836 -0.27658968
C  -2.19546586 -1.18176804 -0.4300104
H  3.90883217 1.26660741 0.22519346
H  0.23378513 3.23628303 -0.83436593
H  -1.76678918 2.1052282 -1.09744943
H  -1.53564622 0.64757755 -2.06451024
C  -3.62243509 0.80709042 0.07000134
H  -1.06075347 -1.23934346 2.28014942
H  0.1490383 0.06799014 2.22902558
O  -3.1181023 -1.74848725 -0.93322725
H  -4.08832965 0.792725 -0.9157457
H  -3.59873884 1.83252891 0.44142495
H  -4.20964404 0.1899791 0.75067467
H  0.69398933 -1.91813221 0.77231142
H  0.82665584 -0.68571359 -1.46627431
O  2.78676824 -1.18233633 0.15510301
C  4.19272719 -1.23873082 0.49115881
H  4.3705343 -0.67999268 1.40956556
H  4.40487489 -2.29288614 0.63622063
H  4.77869694 -0.83810791 -0.33577812
H  2.62177281 3.27968955 -0.25959704
