program: Gaussian 16
title: Title Card Required
version: ES64L-G16RevA.03
frameworkgroup: C1[X(C14H19O5)]
method: RM062X
basis: 6-311G(d,p)
operation: Freq
keyword: #P
keyword: Geom=AllCheck
keyword: Guess=TCheck
keyword: SCRF=Check
keyword: GenChk
keyword: RM062X/6-311G(d,p)
keyword: Freq
converged: YES YES YES YES
title: Mulliken charges:
elementType: C C C C C C C C O C C O C H H O H H H C H H O H H H H C H H H O C H H H H H
charge: -0.151451 -0.146704 0.174792 -0.142403 -0.126390 -0.111117 -0.281375 -0.105917 -0.395549 -0.136465 0.188630 -0.315595 0.496923 0.154625 0.159172 -0.380503 0.179435 0.206739 0.193134 -0.311513 0.228025 0.226744 -0.327975 0.178674 0.183716 0.171696 0.142704 -0.228656 0.168524 0.153008 0.154840 -0.321195 -0.167006 0.211372 0.214090 0.209201 0.267470 0.386298
chargesum: 1.00000
title: Mulliken charges with hydrogens summed into heavy atoms:
elementType: C C C C C C C C O C C O C O C O C O C
charge: 0.003174 0.012469 0.174792 0.037033 -0.126390 0.031587 0.118498 -0.105917 -0.395549 0.318305 0.456101 -0.315595 0.496923 -0.380503 0.222572 -0.327975 0.247716 0.065103 0.467657
polarizability: 2.45392466e+02 1.31619110e+01 2.24720813e+02 8.76616028e+00 -1.26262703e+01 1.54220306e+02
1716.lowfreq: -25.2085 -0.0006 0.0003 0.0006 8.5387 11.8250 35.2845 39.9399 72.2437
frequency: 14.0296 34.6367 71.7084 80.1676 88.0752 91.6295 142.3742 161.4062 175.7686 205.9431 213.8623 222.9517 250.4811 270.6375 298.0040 303.6807 305.5981 322.7013 405.7729 423.9239 452.6282 457.6420 468.6139 487.7728 503.2229 548.9305 562.3001 566.2711 581.9127 650.4346 692.6245 708.0914 729.1970 735.2834 755.6747 785.4745 812.4595 868.7313 889.4213 902.1671 909.3011 928.6996 952.6844 956.7836 977.9981 979.5531 1002.0682 1010.6073 1077.0004 1081.9454 1091.7455 1098.0364 1119.1336 1151.1246 1172.0371 1179.0388 1183.1377 1191.9852 1209.7898 1211.8922 1222.3752 1227.0554 1238.7380 1272.3586 1310.5379 1315.2636 1336.4055 1352.3174 1358.4848 1386.6920 1403.7677 1410.7072 1422.3897 1451.6519 1472.8567 1474.0810 1481.5481 1483.4323 1489.2299 1490.3048 1493.9327 1497.3568 1498.9134 1510.0648 1530.0136 1540.4147 1664.3283 1670.2798 1913.7039 3049.0509 3076.0012 3080.5836 3109.7231 3118.0953 3122.9526 3145.0607 3154.9576 3176.3243 3180.3898 3186.7519 3200.5909 3204.9406 3215.6082 3224.2322 3225.3085 3237.8119 3247.5953 3543.8813
redmass: 4.3806 4.7380 4.1581 4.0433 4.0804 4.1217 1.9089 2.5377 5.1933 2.6677 2.2350 2.6137 2.5259 1.3695 2.7501 1.6105 2.5292 3.5392 2.4469 3.5957 4.0165 3.1877 3.3240 3.0243 6.0227 4.5384 4.8679 4.8896 4.3080 4.9775 2.1060 2.3030 4.2280 3.9380 2.1488 4.8961 1.6855 2.3024 1.5995 3.1872 1.4974 2.7711 2.7559 2.3482 2.7866 1.9156 1.2958 6.0019 1.8301 2.5482 3.9592 1.8325 1.8269 3.6218 1.1513 1.5096 1.2801 1.3591 1.8505 2.1158 2.9742 1.7060 3.4863 1.7412 2.0571 1.7657 1.3517 1.3730 2.6445 1.6205 1.3317 1.2982 1.2385 1.5840 1.6065 1.0715 1.1037 1.1020 1.1077 1.0762 1.0485 1.0429 1.3323 1.3491 1.0737 2.6078 6.8436 6.1033 12.9742 1.0346 1.0381 1.0628 1.0631 1.1074 1.0266 1.1011 1.1009 1.1046 1.1014 1.1070 1.0935 1.0876 1.0925 1.0917 1.0976 1.1131 1.1128 1.0677
irintensity: 4.0423 7.0103 1.6541 5.5223 2.8639 7.1785 3.2383 13.6050 7.4402 2.3747 6.4336 0.8447 2.4098 1.7978 3.7761 0.6603 19.2216 7.7879 11.9065 7.5021 0.1999 4.6584 11.2069 28.7561 4.5055 4.1421 10.5710 20.8389 3.8519 19.6924 248.6428 74.2163 23.5467 35.7991 20.6387 43.1054 47.3680 9.1617 65.9797 102.9778 13.9150 61.8436 56.9880 18.3065 11.5699 26.3646 0.0173 5.1844 25.1558 227.2078 62.0338 1.4246 51.3598 98.8542 5.4760 70.1144 1.6112 76.1664 173.6506 60.9390 144.2558 41.0282 196.8020 2.3294 13.5249 324.0584 14.6800 32.3549 94.7206 45.6037 7.8219 19.7802 65.0027 118.9881 56.3590 20.2118 4.9695 11.9957 13.2199 25.0914 39.0580 14.2433 12.0373 62.7078 17.0634 117.3485 42.4811 173.8539 418.5130 43.1938 5.6400 19.8025 4.4997 35.8743 1.6272 4.9698 11.6566 2.0740 19.1591 0.3126 0.5752 4.9319 10.2519 1.5166 3.5115 0.4761 1.2472 444.2133
temp: 298.150 k
press: 1.00000 atm
elementType: 6 6 6 6 6 6 6 6 8 6 6 8 6 1 1 8 1 1 1 6 1 1 8 1 1 1 1 6 1 1 1 8 6 1 1 1 1 1
symmnumber: 1
zpe: 844239.6 jmol-1
zpe.correction: 0.321554 hartree
zpe.thermalcorrener: 0.339638 hartree
zpe.thermalcorrenthalpy: 0.340582 hartree
zpe.thermalcorrgfe: 0.274434 hartree
zpe.sumelectzpe: -920.395996 hartree
zpe.sumelectthermal: -920.377912 hartree
zpe.sumelectthermalent: -920.376968 hartree
zpe.sumelectthermalfe: -920.443116 hartree
dipole: -14.7882 -3.9582 1.0197
dipole: 15.3426
quadrupole: -47.3010 -100.8146 -100.7889
quadrupole: 31.3420 -1.8723 7.6803
quadrupole: 35.6672 -17.8464 -17.8208 31.3420 -1.8723 7.6803
hfenergy: -920.71755 hartree
pointgroup: C01[X(C14H19O5)]
dipole: -5.8537181 -1.4635206 -0.1689015 debye
polarizability: 246.239054|8.1769571|221.6751437|12.0508449|18.0980748|156.4193882 unknown
InChI: InChI=1S/C14H19O5/c1-14(13(15)19-12(17-3)9-18-14)8-10-5-4-6-11(7-10)16-2/h4-7,12,17H,8-9H2,1-3H3
charge 1 multiplicity 1
38 atoms
C  2.36215667 -2.31224403 -0.96632153
C  3.56712861 -1.7365324 -0.60104907
C  3.62174807 -0.37218046 -0.29627745
C  2.46186155 0.40003089 -0.3596182
C  1.24563848 -0.19030777 -0.72163742
C  1.19822763 -1.54645081 -1.02899481
C  -0.00324628 0.65573765 -0.75702733
C  -0.82493333 0.57366651 0.5465927
O  -1.24677348 -0.79074854 0.66926725
C  -2.40986133 -0.95238379 1.4561931
C  -3.51832148 -0.3341052 0.64717554
O  -3.29687246 1.00107196 0.3603168
C  -2.01552408 1.52203078 0.36831469
H  2.32798121 -3.36848381 -1.20755988
H  4.48102943 -2.31638937 -0.54917429
O  4.83968794 0.11007101 0.04568517
H  2.4845815 1.45885706 -0.13316979
H  0.2533331 1.70442961 -0.91521847
H  -0.65371602 0.34145795 -1.58045204
C  -0.03875946 1.00515602 1.78092886
H  -2.34673381 -0.45705378 2.42863571
H  -2.57909207 -2.01824024 1.59730074
O  -1.89978987 2.69432616 0.22088999
H  0.35380402 2.01245694 1.63661433
H  0.78862674 0.31137377 1.93002655
H  -0.66903007 1.00649455 2.67239944
H  0.25968872 -2.00515474 -1.31699352
C  4.94177103 1.49005008 0.36231632
H  5.98712608 1.66387052 0.60870606
H  4.31801179 1.74504101 1.22430179
H  4.66155247 2.11296376 -0.49210701
O  -3.50996214 -1.08675683 -0.63830915
C  -4.35832145 -0.57582803 -1.73577762
H  -3.95077035 0.36786048 -2.08699846
H  -4.33849644 -1.34919835 -2.4971071
H  -5.35061844 -0.46320877 -1.3079222
H  -4.52804236 -0.45589315 1.02920848
H  -2.57758712 -1.2501743 -0.91199775
