program: Gaussian 16
title: Title Card Required
version: ES64L-G16RevA.03
frameworkgroup: C1[X(C13H15O4)]
method: RM062X
basis: 6-311G(d,p)
operation: Freq
keyword: #P
keyword: Geom=AllCheck
keyword: Guess=TCheck
keyword: SCRF=Check
keyword: GenChk
keyword: RM062X/6-311G(d,p)
keyword: Freq
converged: YES YES YES YES
title: Mulliken charges:
elementType: C C C C C C C C O C C O C H H O H H H C H H O H H H H H C H H H
charge: -0.015356 -0.122466 0.265909 -0.132303 -0.038826 -0.070455 -0.150932 -0.134992 -0.369408 -0.042912 -0.062905 -0.360880 0.444916 0.186713 0.186926 -0.318419 0.202473 0.227512 0.193281 -0.332480 0.214004 0.219867 -0.365767 0.171718 0.171658 0.174144 0.212801 0.316570 -0.231867 0.190537 0.184586 0.186352
chargesum: 1.00000
title: Mulliken charges with hydrogens summed into heavy atoms:
elementType: C C C C C C C C O C C O C O C O C
charge: 0.171357 0.064459 0.265909 0.070170 -0.038826 -0.070455 0.269862 -0.134992 -0.369408 0.390960 0.149896 -0.044310 0.444916 -0.318419 0.185040 -0.365767 0.329608
polarizability: 3.10725795e+02 -5.30020419e+01 2.11736643e+02 1.84118105e+01 1.22129816e+01 1.30220805e+02
1716.lowfreq: 0.0005 0.0010 0.0013 12.7152 18.5726 32.4562 49.3366 61.1198 80.4708
frequency: 48.6992 61.0144 80.1983 136.2001 169.7253 175.9126 198.6810 207.9711 240.6895 245.2079 267.1215 278.8930 314.4728 315.0453 360.3135 361.5344 378.9903 393.0371 444.0911 479.9179 532.2770 541.9712 570.4443 587.3570 611.2976 657.8507 689.2539 734.2831 755.2528 768.9122 793.1932 797.9960 841.2896 856.8049 892.2943 907.9755 932.9868 977.5450 1005.1348 1010.8126 1020.7034 1051.7596 1063.3702 1118.5619 1148.6722 1164.1197 1181.1149 1189.5526 1213.1050 1223.5544 1241.8176 1258.5021 1281.8745 1287.3179 1304.6857 1357.6964 1370.2528 1394.4376 1400.4043 1406.6164 1416.9263 1429.1911 1444.1188 1453.0776 1479.5966 1483.6897 1492.8578 1502.7595 1503.0960 1532.0784 1558.3188 1572.4959 1644.9026 1679.7633 1861.8004 2992.4522 3074.1934 3077.4930 3077.7563 3085.3727 3146.2242 3160.6583 3173.5611 3174.2646 3178.1793 3215.2418 3223.8596 3243.1935 3246.8501 3753.1446
redmass: 6.3492 4.6985 7.9421 3.6808 3.3867 3.4200 3.9151 3.6487 1.8610 1.3983 1.5129 1.8808 3.4558 4.7364 3.2635 3.7156 2.8320 4.9562 2.7836 4.2431 4.0782 4.8145 1.3303 3.1315 3.4637 4.2193 4.9494 4.2339 4.4899 3.8103 5.1329 2.0852 1.9825 1.7328 2.1089 1.7733 2.5569 1.9444 2.4211 1.3066 2.6531 1.7766 3.9442 2.7651 1.9716 3.2300 1.2787 1.9740 1.8031 1.3448 2.7408 2.3759 1.3729 1.7140 1.1197 1.9923 2.3130 1.6112 1.6082 1.4415 1.5811 1.5726 1.1934 1.3618 1.0763 1.2000 1.1124 1.0452 1.4355 2.2394 3.1112 4.3519 5.4094 5.9618 11.2953 1.0706 1.0598 1.0436 1.0822 1.0319 1.0976 1.1039 1.1094 1.1047 1.0894 1.1058 1.0910 1.0984 1.0923 1.0650
irintensity: 1.0276 2.3625 3.0347 8.0432 2.4922 2.0710 3.6132 6.1600 4.3024 2.9309 3.7317 3.8837 15.5549 0.5540 0.9414 3.6674 1.3232 7.1517 6.4252 8.5379 44.5213 15.2022 115.5404 67.0649 48.8742 74.6680 47.5676 0.8547 18.1123 26.3606 34.7549 14.0705 40.5163 41.8572 19.2193 38.9353 66.8346 8.3285 21.3305 0.1458 39.8299 11.3048 67.4249 34.0035 130.4153 204.3711 0.4679 140.0108 160.8735 23.6216 77.7567 125.1062 44.4034 429.1570 6.5370 195.2329 243.5726 523.9717 303.2005 80.3129 109.4198 299.0657 13.8252 182.4071 32.0998 9.1627 20.9270 19.4938 60.8747 518.3362 301.9385 225.9278 274.0788 958.1714 400.0747 54.3316 2.6889 8.6950 17.5868 22.9175 4.1770 7.2828 7.2677 6.9329 0.9425 6.6563 0.9005 3.7576 3.0030 238.7287
temp: 298.150 k
press: 1.00000 atm
elementType: 6 6 6 6 6 6 6 6 8 6 6 8 6 1 1 8 1 1 1 6 1 1 8 1 1 1 1 1 6 1 1 1
symmnumber: 1
zpe: 694898.1 jmol-1
zpe.correction: 0.264673 hartree
zpe.thermalcorrener: 0.279849 hartree
zpe.thermalcorrenthalpy: 0.280793 hartree
zpe.thermalcorrgfe: 0.223029 hartree
zpe.sumelectzpe: -804.748618 hartree
zpe.sumelectthermal: -804.733441 hartree
zpe.sumelectthermalent: -804.732497 hartree
zpe.sumelectthermalfe: -804.790262 hartree
dipole: 2.9721 2.3419 -0.6923
dipole: 3.8467
quadrupole: -62.2758 -66.6663 -92.8404
quadrupole: -10.7768 -5.8676 5.8774
quadrupole: 11.6517 7.2612 -18.9129 -10.7768 -5.8676 5.8774
hfenergy: -805.0132905 hartree
pointgroup: C01 [X(C13H15O4)]
dipole: 1.150771 0.9177193 -0.3520445 debye
polarizability: 312.7486224|-48.9182957|211.0977205|23.7582566|4.8639502|128.8368999 unknown
InChI: InChI=1S/C13H15O4/c1-13(12(14)15)8-10-7-11(16-2)4-3-9(10)5-6-17-13/h3-5,7,14H,6,8H2,1-2H3
charge 1 multiplicity 1
32 atoms
C  1.47276107 2.14589693 0.01162129
C  2.70281166 1.61170065 0.18376789
C  2.86444595 0.20801234 0.02443487
C  1.76970324 -0.61603567 -0.32718015
C  0.52120775 -0.08626519 -0.5259138
C  0.32749045 1.33687449 -0.34210577
C  -0.56870188 -1.01428509 -0.97590585
C  -1.97721534 -0.7847198 -0.42505788
O  -2.5975552 0.31371641 -1.06901816
C  -2.26303719 1.61035558 -0.67073356
C  -0.86555144 2.00431869 -0.41492016
O  -3.10284281 -0.15677379 1.57376944
C  -1.95516092 -0.64543254 1.10103884
H  1.31781296 3.21065523 0.1427863
H  3.56654996 2.20594019 0.45135204
O  4.07394002 -0.24166886 0.22486469
H  1.91286528 -1.68176506 -0.44299743
H  -0.65541815 -0.93376496 -2.0649739
H  -0.26030881 -2.03563927 -0.75174829
C  -2.85700528 -1.99122024 -0.75125628
H  -2.81048331 1.90256061 0.24276584
H  -2.63689395 2.28435895 -1.45078898
O  -1.03648549 -0.98927368 1.79323838
H  -2.48171622 -2.88743068 -0.25469352
H  -2.84910117 -2.15003579 -1.83117654
H  -3.8784558 -1.79493429 -0.42587194
H  -0.81455893 3.07096567 -0.20115913
H  -3.05461929 -0.14617544 2.5448052
C  4.35739245 -1.64833937 0.11306782
H  5.41592349 -1.74196058 0.33544177
H  4.15292091 -1.99133552 -0.90154399
H  3.76758527 -2.20661244 0.84098706
