program: Gaussian 16
title: Title Card Required
version: ES64L-G16RevA.03
frameworkgroup: C1[X(C13H15O4)]
method: RM062X
basis: 6-311G(d,p)
operation: Freq
keyword: #P
keyword: Geom=AllCheck
keyword: Guess=TCheck
keyword: SCRF=Check
keyword: GenChk
keyword: RM062X/6-311G(d,p)
keyword: Freq
converged: YES YES YES YES
title: Mulliken charges:
elementType: C C C C C C C C O C C O C H H O H H H C H H O H H H H C H H H H
charge: -0.034704 -0.139382 0.235322 -0.145824 -0.027222 -0.023872 -0.162091 -0.157722 -0.375278 0.049354 -0.153908 -0.370720 0.533231 0.178775 0.177889 -0.346259 0.191606 0.223830 0.210554 -0.307673 0.194061 0.210937 -0.329325 0.170103 0.171415 0.172600 0.228709 -0.232014 0.182280 0.172489 0.172439 0.330400
chargesum: 1.00000
title: Mulliken charges with hydrogens summed into heavy atoms:
elementType: C C C C C C C C O C C O C O C O C
charge: 0.144071 0.038507 0.235322 0.045782 -0.027222 -0.023872 0.272292 -0.157722 -0.375278 0.454351 0.074801 -0.370720 0.533231 -0.346259 0.206445 0.001074 0.295194
polarizability: 2.91064975e+02 -2.23942147e+01 2.15419014e+02 6.95060324e+00 3.69377963e+00 1.35689836e+02
1716.lowfreq: -327.4003 -9.1116 -0.0008 -0.0004 0.0006 15.8900 21.5494 47.4994 73.0967
frequency: -327.3987 43.8065 72.4710 111.2948 134.1618 156.6265 169.2214 197.1613 250.7725 257.0073 269.2997 277.6752 318.1187 324.4452 349.4257 384.9986 399.7907 429.9262 457.4597 473.2842 514.1387 539.5998 570.6872 623.7309 636.4484 655.8429 696.5261 737.4228 756.2157 776.8994 806.0006 844.5738 850.9607 865.5844 893.7041 917.3970 936.1809 979.4106 1000.4780 1008.4406 1026.5952 1074.5727 1091.4247 1132.4569 1141.9090 1179.9403 1182.7626 1196.5872 1209.7233 1215.2703 1223.9020 1242.5668 1263.9006 1283.3070 1302.2472 1327.1379 1340.4894 1377.3879 1395.9815 1412.3717 1431.5727 1436.3303 1453.8262 1468.6254 1475.4507 1484.4096 1488.8607 1492.7801 1501.0241 1506.0270 1527.8630 1563.6799 1600.5850 1657.7256 1748.3276 3049.2840 3070.3567 3074.7100 3085.9467 3106.3714 3123.5470 3151.4028 3168.6452 3182.5413 3201.1423 3211.8852 3219.3856 3233.0791 3240.7310 3718.6882
redmass: 6.6754 4.5218 4.1488 4.9302 3.9057 2.8089 3.4608 3.0887 1.0402 2.3377 2.4491 1.8471 3.5770 4.1718 4.2974 3.9863 4.3783 4.3324 3.4367 4.0853 4.7207 3.7757 3.2596 2.7211 2.4664 2.0889 4.2911 4.0849 4.5851 3.9063 5.8797 3.8095 1.5898 1.9409 1.5206 1.9301 2.3066 1.9164 2.0792 1.2992 2.3048 3.2314 1.6549 2.2362 1.8395 2.6683 1.2809 2.5503 1.4904 3.5058 1.4832 1.7615 2.1523 1.2059 1.3028 1.8461 2.8055 1.7186 3.5746 1.3605 1.4373 1.2212 1.6438 1.8980 1.1110 1.1014 1.1355 1.2908 1.0938 1.3434 2.5569 3.6364 6.5132 5.8583 9.9993 1.0638 1.0330 1.0611 1.0353 1.0980 1.1023 1.1091 1.1049 1.1045 1.1037 1.0910 1.0909 1.0917 1.0965 1.0650
irintensity: 873.7393 0.3649 7.1832 2.9888 11.6497 0.8711 2.9276 1.8710 0.7591 4.2771 0.8934 0.3157 2.4541 12.8106 1.4414 26.5646 19.6986 3.0942 7.1746 45.2409 15.8088 68.0893 32.7401 5.3026 114.6716 113.5773 15.0157 13.8091 4.5666 74.8257 22.5735 32.9997 60.6537 51.9537 27.5308 15.3163 0.5054 11.4020 9.4038 7.7044 17.3943 62.5230 48.9803 113.9677 116.7313 10.1921 1.4486 151.9985 9.5327 268.8062 1.9226 254.6565 479.0794 23.4677 6.9454 1.2374 333.2547 68.4447 1150.5295 26.9325 4.0064 40.5985 57.6611 59.0312 29.5322 35.0426 26.0914 134.1232 14.3907 195.8862 144.9937 3.6675 93.4667 869.5278 669.7695 16.1321 35.6598 0.4001 5.7205 18.8731 0.7051 16.0197 7.5736 4.5557 11.6279 2.8363 0.1810 1.6000 1.4168 358.0211
temp: 298.150 k
press: 1.00000 atm
elementType: 6 6 6 6 6 6 6 6 8 6 6 8 6 1 1 8 1 1 1 6 1 1 8 1 1 1 1 6 1 1 1 1
symmnumber: 1
zpe: 693729.6 jmol-1
zpe.correction: 0.264228 hartree
zpe.thermalcorrener: 0.278652 hartree
zpe.thermalcorrenthalpy: 0.279597 hartree
zpe.thermalcorrgfe: 0.223355 hartree
zpe.sumelectzpe: -804.734631 hartree
zpe.sumelectthermal: -804.720206 hartree
zpe.sumelectthermalent: -804.719262 hartree
zpe.sumelectthermalfe: -804.775503 hartree
dipole: -0.3214 0.1592 0.9755
dipole: 1.0394
quadrupole: -66.9105 -70.8437 -89.8299
quadrupole: -9.5974 -5.4320 -1.8810
quadrupole: 8.9509 5.0176 -13.9685 -9.5974 -5.4320 -1.8810
hfenergy: -804.9988582 hartree
pointgroup: C01 [X(C13H15O4)]
dipole: -0.3541335 -0.2043722 0.0061806 debye
polarizability: 221.0884088|-77.9185655|210.5720498|-22.1191847|1.6034039|210.5133656 unknown
InChI: InChI=1S/C13H15O4/c1-13(12(14)15)8-10-7-11(16-2)4-3-9(10)5-6-17-13/h3-5,7,14H,6,8H2,1-2H3
charge 1 multiplicity 1
32 atoms
C  3.24892513 -0.31898761 1.98912727
C  4.2140515 -1.19394756 1.57850636
C  4.72118426 -1.08587056 0.26824617
C  4.22284196 -0.10671676 -0.60704265
C  3.26631714 0.80159277 -0.19114472
C  2.79034765 0.73134997 1.14704015
C  2.73121957 1.74417696 -1.24528999
C  1.48039869 2.5718292 -0.90562424
O  1.80223309 3.48470493 0.13211548
C  1.68798493 3.07196947 1.4729252
C  1.86624004 1.62615469 1.72999904
O  0.1586389 1.21807314 0.63081727
C  0.33884342 1.63146934 -0.50505335
H  2.84121992 -0.39477536 2.9907305
H  4.59159595 -1.97784022 2.22216008
O  5.64963977 -1.97117608 -0.06518503
H  4.56896815 -0.06396414 -1.63169748
H  3.50583079 2.47738805 -1.49127475
H  2.54434864 1.16246 -2.15211757
C  1.08341854 3.42998239 -2.09956985
H  0.73179408 3.38807207 1.89824875
H  2.48402076 3.57145478 2.04210228
O  -0.41925947 1.25509042 -1.50631941
H  0.90872694 2.81951377 -2.98427784
H  1.89925292 4.12606627 -2.29822919
H  0.18186 3.99874908 -1.86853964
H  1.48267892 1.32782324 2.7026859
C  6.19921467 -1.94488282 -1.38611828
H  6.94111744 -2.73830463 -1.4069732
H  6.67826007 -0.98379917 -1.58258905
H  5.4229729 -2.14452163 -2.12762607
H  -1.08407928 0.61531735 -1.1899844
