program: Gaussian 16
title: Title Card Required
version: ES64L-G16RevA.03
frameworkgroup: C1[X(C13H15O4)]
method: RM062X
basis: 6-311G(d,p)
operation: Freq
keyword: #P
keyword: Geom=AllCheck
keyword: Guess=TCheck
keyword: SCRF=Check
keyword: GenChk
keyword: RM062X/6-311G(d,p)
keyword: Freq
converged: YES YES YES YES
title: Mulliken charges:
elementType: C C C C C C C C O C C O C H H O H H H C H H O H H H H C H H H H
charge: -0.036168 -0.135716 0.213474 -0.114795 -0.131684 -0.093710 -0.193293 -0.138118 -0.316052 0.085100 -0.100724 -0.381679 0.502309 0.173975 0.175144 -0.355444 0.190218 0.239067 0.205624 -0.324714 0.251730 0.253101 -0.355705 0.176364 0.175843 0.178272 0.248717 -0.230988 0.179206 0.168612 0.167272 0.324763
chargesum: 1.00000
title: Mulliken charges with hydrogens summed into heavy atoms:
elementType: C C C C C C C C O C C O C O C O C
charge: 0.137807 0.039429 0.213474 0.075422 -0.131684 -0.093710 0.251397 -0.138118 -0.316052 0.589931 0.147994 -0.381679 0.502309 -0.355444 0.205765 -0.030942 0.284101
polarizability: 2.76950472e+02 -2.84960818e+01 2.10625437e+02 1.55211990e+01 2.06642265e+01 1.34016247e+02
1716.lowfreq: -784.2857 -8.8209 -0.0004 0.0001 0.0003 4.0230 14.8153 52.4228 67.5305
frequency: -784.2819 48.6858 67.5197 90.2782 131.9985 161.7616 171.5336 192.4299 226.4885 240.7924 250.9840 274.6906 300.7603 319.4908 325.7912 348.0837 391.8108 408.4077 461.9261 482.5085 520.2970 533.5492 543.1211 582.7139 603.3806 633.7814 663.7308 706.3790 730.1259 760.5243 775.0114 812.3656 815.8414 856.6128 870.7571 881.0883 892.4103 940.9765 984.1247 996.3854 997.9159 1075.0190 1102.0097 1116.1791 1145.9517 1173.3689 1182.9112 1191.6612 1192.1829 1208.3303 1215.3391 1220.4071 1228.9309 1256.6413 1280.5483 1312.5917 1332.8962 1367.8676 1371.8978 1398.2250 1409.9041 1431.0208 1449.6759 1466.0438 1483.4998 1488.5168 1492.0971 1494.0094 1499.5522 1512.0295 1553.9833 1599.0103 1628.3481 1667.8693 1858.5584 2153.5855 3067.3317 3083.5853 3087.4323 3144.8688 3155.7811 3165.7607 3185.4376 3190.3449 3198.5383 3209.2934 3218.5107 3238.2666 3241.4724 3740.1997
redmass: 1.4817 4.7447 5.5748 5.7135 4.7017 3.8478 3.2106 3.9110 2.9357 1.4308 1.7104 1.5666 2.2449 3.2172 5.4953 3.9152 4.0447 4.4717 3.0712 4.7121 3.9950 3.3502 4.0279 2.5958 1.3374 4.0381 4.0988 4.3143 3.7517 4.3375 3.8529 4.8724 1.7761 1.5976 2.7467 2.0102 2.0478 2.3053 1.7759 1.3655 2.4438 3.6577 2.2014 2.1568 1.4126 1.4292 1.2789 2.1346 1.4591 1.8692 2.1381 1.6332 1.7600 1.7570 1.5010 1.6737 3.3055 1.7480 1.4971 2.8575 1.6222 1.7211 1.5124 1.2807 1.2724 1.3587 1.1323 1.1432 1.0439 1.6995 3.0133 6.5547 6.8423 5.9604 11.1355 1.0738 1.0335 1.0363 1.0644 1.1084 1.0999 1.1053 1.1037 1.0900 1.1032 1.0922 1.0911 1.0967 1.0915 1.0649
irintensity: 2840.6665 0.4068 0.4514 5.1232 12.3862 0.4874 1.5612 15.1682 6.9821 7.5845 8.4593 0.1549 13.9647 4.5844 2.0574 4.4126 11.1426 2.8932 7.8886 20.9999 8.4105 4.2125 7.1566 34.7065 165.3721 16.7278 17.8658 14.2060 8.0497 57.2757 43.2420 23.6467 35.1130 44.9423 6.9584 28.0633 40.7213 1.7111 1.7786 2.8517 3.9843 8.4582 147.8331 148.3611 77.5060 83.3192 1.4404 26.4544 18.7033 101.4762 123.8075 32.7034 82.6257 169.3770 9.6002 67.7055 233.6603 156.3829 28.3275 478.8259 19.1730 12.0158 105.1934 75.8284 37.7987 40.7117 19.7404 41.9316 17.6493 74.8524 215.9529 159.3544 27.3566 645.2040 451.8340 182.9723 38.1204 4.8945 2.0835 20.7955 1.0499 6.7831 2.0516 22.4151 11.8097 25.7654 0.5303 0.5619 1.8746 254.9934
temp: 298.150 k
press: 1.00000 atm
elementType: 6 6 6 6 6 6 6 6 8 6 6 8 6 1 1 8 1 1 1 6 1 1 8 1 1 1 1 6 1 1 1 1
symmnumber: 1
zpe: 684769.5 jmol-1
zpe.correction: 0.260815 hartree
zpe.thermalcorrener: 0.275656 hartree
zpe.thermalcorrenthalpy: 0.276600 hartree
zpe.thermalcorrgfe: 0.219575 hartree
zpe.sumelectzpe: -804.735637 hartree
zpe.sumelectthermal: -804.720796 hartree
zpe.sumelectthermalent: -804.719851 hartree
zpe.sumelectthermalfe: -804.776877 hartree
dipole: -1.5959 2.0087 -1.7270
dipole: 3.0926
quadrupole: -73.5544 -62.8802 -93.3766
quadrupole: -13.0619 3.6096 -0.0268
quadrupole: 3.0493 13.7236 -16.7729 -13.0619 3.6096 -0.0268
hfenergy: -804.9964518 hartree
pointgroup: C01 [X(C13H15O4)]
dipole: 0.4907862 1.006613 0.4756535 debye
polarizability: 147.5685893|-52.0452004|258.7604146|1.6258165|27.2994912|215.2631523 unknown
InChI: InChI=1S/C13H15O4/c1-13(12(14)15)8-10-7-11(16-2)4-3-9(10)5-6-17-13/h3-5,7,14H,6,8H2,1-2H3
charge 1 multiplicity 1
32 atoms
C  3.78930616 -0.15201665 1.823204
C  4.11784242 -1.35572341 1.25562804
C  4.02518824 -1.50983379 -0.13913579
C  3.61316975 -0.43664345 -0.94334215
C  3.28800048 0.78373599 -0.37180274
C  3.35158712 0.93016574 1.02923156
C  2.89001343 1.93219314 -1.25945256
C  1.54321201 2.59074599 -0.90213314
O  1.68494664 3.55378582 0.15188828
C  2.26401009 3.26439945 1.31908156
C  3.02952321 2.15168668 1.70745273
O  0.08904489 1.4787991 0.67301717
C  0.54333616 1.53429994 -0.43847011
H  3.85697933 -0.02220967 2.89754739
H  4.44949118 -2.19661531 1.85119059
O  4.35816691 -2.70998499 -0.61181334
H  3.55785507 -0.5414516 -2.01873058
H  3.64652188 2.72223808 -1.22188872
H  2.82898679 1.58408455 -2.29058776
C  0.98513732 3.38387776 -2.07431993
H  2.28316711 4.12645375 1.97895765
H  1.63324892 2.41314946 1.99853177
O  0.26546657 0.67398364 -1.40953397
H  0.77918301 2.71895526 -2.91183897
H  1.72170653 4.12927638 -2.37839721
H  0.06444482 3.88882855 -1.77860517
H  3.37310428 2.24724632 2.73504791
C  4.30765473 -2.93536707 -2.02103923
H  4.61307184 -3.9687336 -2.16256733
H  5.00010018 -2.27088234 -2.54289909
H  3.29253253 -2.79550869 -2.39899623
H  -0.34667566 -0.00121677 -1.06840355
