program: Gaussian 16
title: Title Card Required
version: ES64L-G16RevA.03
frameworkgroup: C1[X(C14H19O5)]
method: RM062X
basis: 6-311G(d,p)
operation: Freq
keyword: #P
keyword: Geom=AllCheck
keyword: Guess=TCheck
keyword: SCRF=Check
keyword: GenChk
keyword: RM062X/6-311G(d,p)
keyword: Freq
converged: YES YES YES YES
title: Mulliken charges:
elementType: C C C C C C C C O C C O C H H O H H H C H H O H H H H C H H H H O H C H H H
charge: 0.006481 -0.128500 0.250403 -0.162836 0.014620 -0.387802 -0.259655 -0.107376 -0.379484 -0.111995 0.102845 -0.347660 0.466883 0.181032 0.178712 -0.344793 0.196455 0.211433 0.233996 -0.309257 0.229752 0.197246 -0.387152 0.168566 0.167722 0.169983 0.310448 -0.232237 0.182475 0.168268 0.175075 0.229534 -0.270000 0.252497 -0.235149 0.193207 0.194876 0.181383
chargesum: 1.00000
title: Mulliken charges with hydrogens summed into heavy atoms:
elementType: C C C C C C C C O C C O C O C O C O C
charge: 0.187513 0.050212 0.250403 0.033619 0.014620 -0.158267 0.185775 -0.107376 -0.379484 0.315004 0.355343 -0.037211 0.466883 -0.344793 0.197013 -0.387152 0.293582 -0.270000 0.334317
polarizability: 2.50526063e+02 -2.28557636e+01 2.06226955e+02 7.27003248e+00 -4.80823093e+00 2.09038861e+02
1716.lowfreq: -254.0543 -14.0213 -0.0007 -0.0004 0.0002 6.4743 22.1769 24.5078 48.6146
frequency: -254.0500 17.9185 48.2861 60.2407 73.8742 113.6713 128.9100 164.2321 176.1883 187.8896 219.7663 234.0557 248.3567 259.2040 271.1872 279.5785 289.7292 325.8533 338.6556 371.1987 391.1178 408.1906 437.6365 456.0546 471.9022 483.8091 526.5760 561.6567 576.6164 595.4258 611.1267 630.1233 666.2347 709.8851 755.2351 772.9196 800.6998 836.2652 854.4131 875.5856 896.4251 930.2531 954.5747 968.7620 978.1026 996.3587 1004.2174 1022.0377 1073.2745 1094.0196 1111.0302 1115.4635 1146.0705 1165.7095 1176.0657 1180.5403 1182.0211 1188.8434 1201.9669 1208.1822 1223.6511 1228.1461 1241.7170 1295.9208 1318.9210 1325.7916 1345.6845 1363.4128 1373.9965 1383.7335 1393.8964 1427.7517 1430.2907 1449.1573 1467.1541 1473.3563 1479.6491 1487.0169 1491.3522 1492.2471 1498.1740 1508.7162 1526.9774 1527.9348 1535.1442 1541.4233 1607.0452 1677.2284 1855.7641 3068.2075 3069.1256 3069.8933 3085.4938 3096.1177 3122.9300 3146.3591 3148.3494 3153.7753 3162.7495 3189.3655 3199.6506 3202.0240 3212.2077 3213.8739 3221.8620 3226.4237 3237.3359 3738.9471
redmass: 8.1492 4.0781 10.0267 5.3361 4.4384 3.6413 3.5093 3.3600 2.2679 3.1422 2.5714 2.5105 1.7028 3.3112 1.2046 1.9187 2.3921 3.9988 2.2622 4.9250 2.3240 5.4438 3.7447 3.2876 4.2033 3.4886 3.3979 4.6536 3.6911 4.7700 1.5718 2.8170 3.2939 2.9805 4.7648 3.9796 5.2131 1.4096 2.0226 1.9583 1.6233 2.2481 1.6278 2.5247 2.0330 1.8033 2.9432 1.3792 3.8325 2.6219 3.0708 2.0760 2.0585 1.3872 2.7777 1.5532 1.2820 1.2498 1.8578 1.9459 1.4684 1.4187 1.9549 1.4177 1.5033 1.6472 2.1459 1.8732 1.7996 1.2945 1.2892 2.6983 2.8772 1.1018 1.2559 1.3881 1.1040 1.0978 1.1060 1.0900 1.0414 1.1238 1.5813 1.3975 1.4141 2.7538 5.5148 5.9835 10.9863 1.0626 1.0334 1.0381 1.0618 1.0325 1.1016 1.0980 1.1085 1.1031 1.1046 1.1055 1.1036 1.0912 1.1073 1.0903 1.0918 1.0929 1.0982 1.0648
irintensity: 657.5428 1.9511 2.8690 0.6430 2.5718 6.8889 2.2799 3.2229 2.7269 0.7471 7.0349 7.3503 18.4239 4.8765 2.7285 1.6716 5.9633 4.1420 10.3817 11.0351 9.9826 66.3332 61.3735 6.4452 4.3982 20.4735 16.9083 21.2978 9.1883 12.9803 108.6216 77.7600 82.9093 21.4225 1.8823 34.1672 41.7444 161.7645 27.3423 259.9957 36.2881 18.4086 4.7867 106.2232 50.4232 3.7205 6.5454 22.6725 53.6951 33.9436 17.6882 16.9776 50.4433 42.2695 244.0966 116.0174 2.7414 4.8781 36.6540 237.2572 19.3455 19.0076 121.9540 65.8106 223.4583 23.6078 124.0422 190.5063 82.0589 12.1448 8.4604 53.5114 204.7143 26.1346 25.9161 91.5238 51.1511 9.2267 0.8410 25.2964 21.5526 58.0611 108.4134 76.5584 90.5315 198.9466 119.0379 408.9587 404.9755 7.8594 25.7528 10.1207 12.0438 12.8875 4.6763 14.4742 17.4584 7.9249 6.9890 7.8261 10.8877 9.8245 2.4337 12.4004 5.2319 2.7852 0.7395 243.7693
temp: 298.150 k
press: 1.00000 atm
elementType: 6 6 6 6 6 6 6 6 8 6 6 8 6 1 1 8 1 1 1 6 1 1 8 1 1 1 1 6 1 1 1 1 8 1 6 1 1 1
symmnumber: 1
zpe: 839540.0 jmol-1
zpe.correction: 0.319764 hartree
zpe.thermalcorrener: 0.337691 hartree
zpe.thermalcorrenthalpy: 0.338635 hartree
zpe.thermalcorrgfe: 0.273786 hartree
zpe.sumelectzpe: -920.391555 hartree
zpe.sumelectthermal: -920.373628 hartree
zpe.sumelectthermalent: -920.372684 hartree
zpe.sumelectthermalfe: -920.437533 hartree
dipole: -4.0865 -4.4984 -2.6356
dipole: 6.6243
quadrupole: -85.5184 -100.8477 -87.0318
quadrupole: -3.3454 11.1438 2.9626
quadrupole: 5.6142 -9.7151 4.1009 -3.3454 11.1438 2.9626
hfenergy: -920.7113191 hartree
pointgroup: C01 [X(C14H19O5)]
dipole: -0.7474947 0.03796 -2.4964278 debye
polarizability: 233.1363187|25.8043969|234.2029294|8.1586844|8.2147239|198.452631 unknown
InChI: InChI=1S/C14H19O5/c1-14(13(15)16,19-8-7-17-2)10-11-5-4-6-12(9-11)18-3/h4-7,9,15H,8,10H2,1-3H3
charge 1 multiplicity 1
38 atoms
C  -1.03394455 -4.87317915 -0.67476742
C  -2.04473368 -5.60774204 -1.21066296
C  -3.32486958 -5.01499509 -1.37178118
C  -3.57326675 -3.71106855 -0.92935435
C  -2.5416507 -2.95837367 -0.38614366
C  -1.23095252 -3.49852101 -0.35263812
C  -2.8304443 -1.55516343 0.07935079
C  -1.61197962 -0.65058937 0.33136751
O  -0.56553738 -0.77292547 -0.63589762
C  -0.95251338 -1.14660581 -1.93028024
C  -0.71742803 -2.63021421 -2.14467007
O  0.31629939 -1.02424805 1.7168029
C  -1.01373977 -0.98675565 1.70294995
H  -0.04801032 -5.30487854 -0.54794187
H  -1.91470793 -6.63736468 -1.51943593
O  -4.23465457 -5.78860544 -1.94780173
H  -4.56002503 -3.27362511 -1.01216077
H  -3.50594184 -1.07440671 -0.63301722
H  -3.37927335 -1.61276355 1.02384412
C  -2.05983306 0.81084491 0.38685496
H  -0.28464856 -0.64362015 -2.63963777
H  -1.97262712 -0.84460196 -2.16916747
O  -1.69395804 -1.14699851 2.68074886
H  -2.84760459 0.94407766 1.12997847
H  -2.4421614 1.10046689 -0.59454815
H  -1.21209061 1.44982249 0.63965453
H  0.59375229 -1.19100486 2.63376443
C  -5.55802495 -5.28073107 -2.14078337
H  -6.10895775 -6.08108724 -2.62688743
H  -5.53932128 -4.39873701 -2.78511446
H  -6.02099561 -5.04168578 -1.18142762
H  -0.45390006 -2.99389819 0.20916425
O  -1.27947985 -3.27499121 -3.13159601
H  0.30241543 -2.96012187 -1.96941215
C  -2.38825893 -2.70305468 -3.86116022
H  -2.01740232 -1.89519723 -4.49301885
H  -2.77137125 -3.51426348 -4.47439478
H  -3.16450825 -2.34396926 -3.18898751
