program: Gaussian 16
title: Title Card Required
version: ES64L-G16RevA.03
method: RM062X
basis: 6-311G(d,p)
operation: Freq
keyword: #P
keyword: Geom=AllCheck
keyword: Guess=TCheck
keyword: SCRF=Check
keyword: GenChk
keyword: RM062X/6-311G(d,p)
keyword: Freq
converged: YES YES YES YES
title: Mulliken charges:
elementType: C C C C C C C C O C C O C H H O H H H C H H O H H H H C H H H O C H H H H H
charge: -0.146092 -0.148508 0.176576 -0.146494 -0.140351 -0.105152 -0.279278 -0.135960 -0.349642 -0.125761 0.303964 -0.254289 0.567695 0.156864 0.159966 -0.379976 0.178764 0.208747 0.214847 -0.340499 0.252195 0.256780 -0.210111 0.198025 0.206746 0.166118 0.146449 -0.228574 0.168997 0.151202 0.155755 -0.476302 -0.211776 0.143673 0.152589 0.151437 0.260603 0.300774
chargesum: 1.00000
title: Mulliken charges with hydrogens summed into heavy atoms:
elementType: C C C C C C C C O C C O C O C O C O C
charge: 0.010771 0.011458 0.176576 0.032270 -0.140351 0.041297 0.144316 -0.135960 -0.349642 0.383214 0.564567 -0.254289 0.567695 -0.379976 0.230390 -0.210111 0.247381 -0.175529 0.235923
polarizability: 2.09652114e+02 -5.74846769e+00 2.25242640e+02 -3.73745473e+01 -4.54625922e+00 1.90815860e+02
1716.lowfreq: -51.3950 -11.1778 -5.8390 -0.0004 -0.0003 0.0007 17.8105 22.7239 47.0989
frequency: -47.4169 21.7468 46.8185 52.8362 61.7471 81.6183 89.8345 100.8175 103.0281 112.9905 152.7914 169.5185 187.5388 207.2717 226.7769 245.0347 261.3936 292.5524 306.1673 308.9319 323.5008 331.4247 369.6564 403.0146 438.4478 457.4504 461.8121 474.4798 539.7344 543.9074 566.1942 606.8347 666.7234 675.6150 712.4057 746.2294 770.3073 776.4977 817.2616 882.0799 897.1915 911.0085 920.2042 943.4947 961.0570 972.9686 988.8397 1004.9415 1011.9983 1067.1723 1092.4683 1093.2545 1097.4869 1114.9869 1123.8657 1173.1640 1182.7485 1184.6137 1185.8537 1200.6388 1216.2145 1226.1447 1243.4266 1265.7034 1292.8141 1314.4327 1337.5100 1353.1114 1359.7079 1370.5444 1380.5017 1393.1250 1417.5205 1425.1374 1468.8386 1475.7718 1488.1631 1489.1452 1493.3222 1495.9245 1499.1305 1499.8310 1509.1865 1514.4229 1542.1984 1643.1706 1664.8433 1672.5562 2055.2046 2944.4794 3049.4486 3051.8726 3078.0010 3090.3018 3096.0315 3115.5991 3120.7401 3146.2949 3148.1900 3159.6698 3169.7820 3180.5550 3187.0612 3208.0524 3220.8726 3227.9382 3233.1998 3856.7336
redmass: 5.7029 4.1441 4.6469 2.7782 4.6287 3.5868 3.5429 3.2455 2.5237 1.5576 4.1371 5.6362 3.2969 2.2894 2.3778 3.2365 3.5591 1.3824 1.4574 1.3554 1.8571 2.3132 4.8895 2.1820 5.0679 6.9579 3.3985 3.8621 4.4444 5.9434 4.8604 4.7052 4.2668 1.9919 2.5192 3.0768 3.4227 4.9919 1.6114 2.1618 1.5844 3.9397 1.4579 2.4671 1.9546 3.0159 1.8410 1.2978 6.0135 1.6076 3.8751 2.3544 1.8311 1.6782 1.6976 1.1521 1.2877 1.2905 3.0327 2.7167 1.4453 1.7759 3.3575 1.4603 1.6632 2.9821 1.4893 1.2240 2.2300 1.3019 1.7144 1.2978 1.3005 1.4567 1.1454 1.5652 1.0918 1.0652 1.0751 1.0432 1.1313 1.1947 1.4584 1.0474 2.5845 5.9813 6.8174 6.0064 13.1527 1.0719 1.0330 1.0343 1.0349 1.0604 1.0850 1.1066 1.1069 1.1056 1.1037 1.1036 1.1038 1.1020 1.0970 1.0878 1.0926 1.0978 1.0909 1.0667
irintensity: 4.0435 0.5069 1.7967 4.2369 7.7005 3.9984 1.3172 8.6747 3.3098 35.4605 6.8349 25.8236 12.3896 14.1506 2.0191 4.2000 8.3231 4.7043 32.5167 89.6633 44.8200 18.6328 26.9016 4.9226 131.9218 1.8775 45.3351 5.8036 0.3253 55.9440 15.6823 47.9519 47.2726 7.8996 53.9974 5.3734 39.8768 33.3421 55.0769 44.9864 40.9643 59.6596 1.4961 123.8952 89.0693 5.1271 20.2011 0.1628 3.6136 140.1569 50.7231 28.5960 9.3837 7.2835 38.4144 7.2317 0.6376 1.4006 14.6085 156.1480 41.6753 35.8627 63.6162 17.0038 3.6130 232.6251 20.0227 136.6271 119.9741 62.3742 23.6479 45.8947 19.8492 48.6355 11.3780 41.4351 8.4769 10.6069 0.9173 10.8710 26.5658 30.0588 65.0624 8.8733 109.9447 372.8746 43.0538 173.1202 419.4991 186.7554 37.7874 45.4336 1.4793 6.2104 35.9160 49.1070 37.5134 2.0850 30.4764 2.5902 0.6783 19.8043 8.6934 5.6897 3.2567 3.5714 0.6529 124.9505
temp: 298.150 k
press: 1.00000 atm
elementType: 6 6 6 6 6 6 6 6 8 6 6 8 6 1 1 8 1 1 1 6 1 1 8 1 1 1 1 6 1 1 1 8 6 1 1 1 1 1
symmnumber: 1
zpe: 826101.4 jmol-1
zpe.correction: 0.314645 hartree
zpe.thermalcorrener: 0.334440 hartree
zpe.thermalcorrenthalpy: 0.335384 hartree
zpe.thermalcorrgfe: 0.265290 hartree
zpe.sumelectzpe: -920.363728 hartree
zpe.sumelectthermal: -920.343933 hartree
zpe.sumelectthermalent: -920.342989 hartree
zpe.sumelectthermalfe: -920.413083 hartree
dipole: -13.5654 -0.5915 1.2950
dipole: 13.6399
quadrupole: -56.9116 -98.7044 -95.6530
quadrupole: -13.0125 -7.4534 9.5939
quadrupole: 26.8448 -14.9481 -11.8967 -13.0125 -7.4534 9.5939
hfenergy: -920.6783732 hartree
pointgroup: C01 [X(C14H19O5)]
dipole: -5.2194159 -0.3257067 0.1656234 debye
polarizability: 209.6521142|-5.7484677|225.2426404|-37.3745473|-4.5462592|190.8158599 unknown
InChI: InChI=1S/C13H15O4.CH4O/c1-13(12(14)16-6-7-17-13)9-10-4-3-5-11(8-10)15-2;1-2/h3-6,8H,7,9H2,1-2H3;2H,1H3
charge 1 multiplicity 1
38 atoms
C  2.44022452 2.41176978 0.00265918
C  3.21301117 1.70600755 -0.90407994
C  3.13975651 0.30959011 -0.94265804
C  2.28601385 -0.36465747 -0.06931263
C  1.50495779 0.35657396 0.84005037
C  1.58349982 1.74539368 0.8783617
C  0.57086224 -0.3840136 1.76586045
C  -0.88016252 -0.3742912 1.25866484
O  -1.33806494 0.96972754 1.3637513
C  -2.66716648 1.19163275 0.99357
C  -3.59062197 0.2272508 1.58269752
O  -3.20100372 -0.80200681 2.18226263
C  -1.70412981 -1.19565703 2.2285947
H  2.50836893 3.4931465 0.03231329
H  3.88730788 2.2078602 -1.58786376
O  3.93274042 -0.30097107 -1.8543954
H  2.22205168 -1.44584177 -0.07651228
H  0.88338074 -1.42496457 1.86702107
H  0.57438742 0.07254734 2.75874849
C  -1.03809332 -0.96500761 -0.14155807
H  -2.86611523 1.14867268 -0.09721418
H  -2.9679592 2.19163715 1.32625949
O  -1.48893128 -2.07165616 2.95558131
H  -0.5827894 -1.95667295 -0.16758726
H  -0.51316603 -0.31190384 -0.84062405
H  -2.07840323 -1.05042796 -0.46114892
H  0.98139251 2.3002863 1.58750782
C  3.89159436 -1.71804385 -1.92451061
H  4.58957475 -1.99944434 -2.71002469
H  2.88940864 -2.07154433 -2.18491975
H  4.2066901 -2.16970303 -0.97944644
O  -3.49733395 0.35803654 -1.91924578
C  -2.4819571 0.53024346 -2.90244145
H  -2.02930769 -0.42424295 -3.18792362
H  -2.87204105 1.02539578 -3.79582208
H  -1.71300627 1.16695379 -2.46347629
H  -4.6714648 0.35226158 1.49456797
H  -4.21525433 -0.15134498 -2.3102499
