program: Gaussian 16
title: Title Card Required
version: ES64L-G16RevA.03
frameworkgroup: C1[X(C13H15O4)]
method: RM062X
basis: 6-311G(d,p)
operation: Freq
keyword: #P
keyword: Geom=AllCheck
keyword: Guess=TCheck
keyword: SCRF=Check
keyword: GenChk
keyword: RM062X/6-311G(d,p)
keyword: Freq
converged: YES YES NO YES
title: Mulliken charges:
elementType: C C C C C C C C O C C O C H H O H H H C H H O H H H H H C H H H
charge: -0.146482 -0.144794 0.167849 -0.112648 -0.146839 -0.120000 -0.292874 -0.143832 -0.347943 -0.116055 0.314071 -0.258207 0.584443 0.157621 0.160174 -0.380557 0.166637 0.218064 0.217558 -0.324057 0.254047 0.257262 -0.196554 0.197827 0.200776 0.173264 0.260475 0.154693 -0.227874 0.168796 0.149627 0.155532
chargesum: 1.00000
title: Mulliken charges with hydrogens summed into heavy atoms:
elementType: C C C C C C C C O C C O C O C O C
charge: 0.011140 0.015381 0.167849 0.053990 -0.146839 0.034693 0.142747 -0.143832 -0.347943 0.395255 0.574546 -0.258207 0.584443 -0.380557 0.247810 -0.196554 0.246081
polarizability: 1.93121020e+02 -3.14079570e+00 2.19770285e+02 -2.25442732e+01 -9.15561006e+00 1.49622056e+02
1716.lowfreq: -0.0006 0.0004 0.0008 6.5837 11.5371 26.2141 26.6839 64.3441 74.5081
frequency: 26.5148 63.5902 73.6962 106.5500 113.8400 161.6618 169.7247 209.6611 231.8268 247.1252 265.3168 276.4845 304.0608 318.7449 332.7101 354.0371 386.3605 428.0991 454.0014 463.0595 471.7993 510.7499 564.4543 575.6273 585.1406 651.2514 681.6695 713.0030 749.5497 768.3124 779.4538 820.7752 865.3194 892.6219 909.6776 924.7044 942.7700 955.7577 978.5552 1003.6352 1006.6334 1012.7594 1091.8552 1107.7788 1110.0007 1125.1898 1149.7786 1173.3154 1185.9941 1206.6747 1208.2357 1225.8170 1250.1662 1268.5680 1290.9269 1309.6082 1330.8798 1356.0285 1368.7799 1377.5586 1412.6288 1417.9102 1424.9769 1463.1100 1475.0318 1488.4907 1496.9796 1500.4484 1506.1797 1511.5178 1539.6385 1659.5268 1664.9759 1671.5587 2068.9913 3011.1700 3050.1761 3080.8657 3090.1175 3097.1695 3118.6848 3146.0981 3164.0239 3173.2408 3178.7097 3182.6717 3205.8576 3215.8268 3226.5919 3237.2580
redmass: 5.0781 4.8601 4.5677 3.8961 5.4761 4.5942 2.9248 2.5276 2.5732 2.3110 2.2214 2.8883 1.3423 2.0836 3.0186 4.0827 2.9464 5.0115 4.4840 4.4904 3.8888 4.3217 4.7454 4.5104 4.5114 5.2837 1.8780 2.5234 3.0902 3.7656 3.8043 1.6050 2.5798 1.6447 4.2080 1.4410 2.5263 2.3114 1.8322 1.8242 1.3204 5.9114 4.0900 1.7556 1.7218 2.2640 2.0667 1.1430 1.2780 2.0138 2.0872 1.6056 3.3566 1.3409 1.9456 3.1077 1.3960 2.1667 1.2575 1.9420 1.2032 1.2399 1.6748 1.0979 1.7079 1.0660 1.0849 1.3353 1.0761 1.2990 2.5352 5.9635 6.8354 6.1314 13.1003 1.0704 1.0344 1.0353 1.0614 1.0874 1.1070 1.1045 1.1040 1.1047 1.1016 1.0971 1.0881 1.0922 1.0980 1.0912
irintensity: 0.1967 5.9803 1.5498 5.8030 4.4627 5.2847 22.4864 3.3373 0.9891 1.9602 18.4354 19.2009 0.5807 16.4344 8.1721 49.8571 9.1001 141.2266 22.2136 18.1975 3.7002 32.5564 5.5828 5.3634 82.3059 3.7067 1.5610 48.8576 9.7229 36.3336 18.4087 82.2776 42.4224 31.5664 123.0809 6.3536 45.7313 83.1241 23.0885 4.3510 0.1129 3.4909 56.9501 8.2345 5.4257 27.0572 29.9794 8.1335 1.4462 28.1908 131.1079 10.3469 58.8020 14.4485 13.2703 230.1162 1.2541 86.1497 120.2125 149.6417 14.3182 58.8947 40.0965 13.6742 56.5462 1.4291 15.5188 8.3384 24.6772 69.3329 107.4126 354.7235 39.2489 177.7416 363.3849 31.5287 46.8636 2.0385 8.4518 33.3523 39.4686 0.8049 6.8720 0.4306 19.6083 9.3902 3.2719 4.7947 3.3472 0.8599
temp: 298.150 k
press: 1.00000 atm
elementType: 6 6 6 6 6 6 6 6 8 6 6 8 6 1 1 8 1 1 1 6 1 1 8 1 1 1 1 1 6 1 1 1
symmnumber: 1
zpe: 687666.6 jmol-1
zpe.correction: 0.261918 hartree
zpe.thermalcorrener: 0.277521 hartree
zpe.thermalcorrenthalpy: 0.278465 hartree
zpe.thermalcorrgfe: 0.218998 hartree
zpe.sumelectzpe: -804.703866 hartree
zpe.sumelectthermal: -804.688263 hartree
zpe.sumelectthermalent: -804.687319 hartree
zpe.sumelectthermalfe: -804.746786 hartree
dipole: -13.0250 -7.9144 -0.8747
dipole: 15.2661
quadrupole: -60.7605 -75.0140 -85.3609
quadrupole: 14.9902 5.9266 7.3328
quadrupole: 12.9513 -1.3022 -11.6491 14.9902 5.9266 7.3328
hfenergy: -804.9657841 hartree
pointgroup: C01 [X(C13H15O4)]
dipole: 4.8369782 -2.0983715 2.8764688 debye
polarizability: 198.2734788|-7.2180083|201.1780845|-14.6409802|-33.7511069|163.061798 unknown
InChI: InChI=1S/C13H15O4/c1-13(12(14)16-6-7-17-13)9-10-4-3-5-11(8-10)15-2/h3-6,8H,7,9H2,1-2H3
charge 1 multiplicity 1
32 atoms
C  -2.45106578 2.24185693 -0.93477753
C  -3.39631611 1.49342137 -0.25677814
C  -3.11015893 0.17106603 0.10347815
C  -1.87386719 -0.38518774 -0.21819305
C  -0.91888907 0.38066235 -0.89784694
C  -1.21033459 1.69183598 -1.26102249
C  0.42102411 -0.22747398 -1.24016714
C  1.42905231 -0.23572342 -0.08254209
O  0.79713078 -0.89112793 1.00900906
C  1.54054697 -0.99546709 2.18479714
C  2.1955788 0.25682353 2.56535054
O  2.23045536 1.2548148 1.81390306
C  1.7151155 1.19052048 0.33798615
H  -2.68098417 3.26201996 -1.21948285
H  -4.36644163 1.90156584 0.00070367
O  -4.09492584 -0.48864748 0.75896532
H  -1.63542641 -1.40631894 0.04895794
H  0.30569706 -1.27529531 -1.5285959
H  0.87896735 0.30316817 -2.07678815
C  2.75088801 -0.88595582 -0.49316151
H  2.33298422 -1.76387053 2.15957649
H  0.86889811 -1.27652265 3.00456243
O  1.71863821 2.2242304 -0.17981345
H  3.11938486 -0.41420963 -1.40481881
H  2.55290006 -1.94118641 -0.68934359
H  3.52709997 -0.80226632 0.27010707
H  2.6978698 0.35739064 3.52956759
H  -0.4777616 2.27974274 -1.80188164
C  -3.85408667 -1.83600895 1.13320324
H  -4.75918349 -2.1744261 1.63313358
H  -3.00903746 -1.90938428 1.82436558
H  -3.6678993 -2.46299808 0.25647011
