program: Gaussian 16
title: Title Card Required
version: ES64L-G16RevA.03
frameworkgroup: C1[X(C14H19O5)]
method: RM062X
basis: 6-311G(d,p)
operation: Freq
keyword: #P
keyword: Geom=AllCheck
keyword: Guess=TCheck
keyword: SCRF=Check
keyword: GenChk
keyword: RM062X/6-311G(d,p)
keyword: Freq
converged: YES YES YES YES
title: Mulliken charges:
elementType: C C C C C C C C O C C O C H H O H H H C H H O H H H H C H H H O C H H H H H
charge: -0.150310 -0.149904 0.174964 -0.146333 -0.130746 -0.108319 -0.281858 -0.087552 -0.366959 -0.117068 0.214721 -0.334032 0.485262 0.154653 0.158064 -0.381452 0.178154 0.201670 0.200004 -0.314926 0.201159 0.216147 -0.329438 0.176024 0.181226 0.165272 0.140775 -0.228774 0.167797 0.152057 0.154974 -0.325657 -0.174807 0.215650 0.219182 0.216627 0.253113 0.400641
chargesum: 1.00000
title: Mulliken charges with hydrogens summed into heavy atoms:
elementType: C C C C C C C C O C C O C O C O C O C
charge: 0.004344 0.008161 0.174964 0.031820 -0.130746 0.032455 0.119816 -0.087552 -0.366959 0.300238 0.467835 -0.334032 0.485262 -0.381452 0.207595 -0.329438 0.246054 0.074984 0.476652
polarizability: 2.46453525e+02 -1.03661806e+01 2.27653898e+02 -1.75907434e+01 6.69642315e+00 1.51951397e+02
1716.lowfreq: -3.2121 -0.0004 0.0006 0.0008 13.4962 25.0986 35.1752 52.3298 75.3231
frequency: 29.6880 50.5662 72.6610 80.7133 102.1473 107.8143 132.8343 166.1711 172.7886 216.5602 223.4673 230.8039 238.7879 257.8857 260.3273 306.0195 318.9741 334.8753 367.1800 392.8347 414.9632 449.8172 466.6973 482.4537 502.5018 523.7174 546.0853 566.0941 584.3880 629.2241 662.8342 703.0779 712.6157 733.1501 750.6452 785.5601 816.1410 873.9190 889.7002 896.3081 916.8756 928.1221 945.9407 972.4626 980.8964 988.4037 1001.5332 1011.8106 1074.5783 1091.4484 1102.3264 1123.3506 1143.7791 1163.0942 1173.6244 1185.4100 1188.5882 1206.5204 1210.6666 1217.2656 1227.3004 1243.7388 1249.9720 1278.4629 1313.2312 1329.4588 1340.1674 1357.7748 1363.8608 1380.5799 1400.5513 1414.7430 1442.4518 1451.8454 1470.3242 1472.7444 1476.3769 1479.8470 1488.0417 1493.5825 1496.8284 1500.7622 1510.0454 1510.3180 1529.5077 1540.6276 1665.8136 1671.1397 1913.5281 3048.3185 3053.5587 3082.1353 3083.8868 3117.5033 3125.1887 3144.0077 3159.6018 3169.2804 3173.6644 3177.6640 3182.2360 3206.0206 3219.0324 3224.1914 3226.5565 3240.1726 3248.8069 3608.3581
redmass: 4.8650 4.4786 4.3885 5.2587 3.4377 4.0133 2.6370 3.6657 3.9389 1.4798 1.4373 1.8434 2.5525 2.9114 2.5003 1.4169 3.9123 3.2079 3.8987 2.8244 3.4233 3.3267 4.0511 3.3158 4.2020 4.1311 5.4055 4.8859 4.7449 3.7390 1.7012 2.3635 2.9798 4.5798 3.1667 4.9749 1.6183 2.3693 1.6240 4.1341 1.4355 2.4672 2.9376 2.6760 2.1122 2.5367 1.2952 5.9943 2.1528 4.0449 1.7853 1.8105 2.8643 3.2368 1.1590 1.2787 1.8229 1.3688 1.6658 2.4404 1.7118 3.7905 2.3394 2.0136 3.1316 1.3187 1.2978 1.6994 1.7074 1.6550 1.3499 1.2701 1.3967 1.2604 1.2301 1.0750 1.3721 1.1063 1.0769 1.0625 1.0466 1.3989 1.0973 1.2917 1.0788 2.5547 6.8281 6.1184 12.9556 1.0344 1.0686 1.0460 1.0513 1.1074 1.0264 1.1036 1.1025 1.0969 1.1044 1.1015 1.0922 1.0876 1.0923 1.0915 1.0976 1.1122 1.1126 1.0684
irintensity: 6.9076 2.9099 2.5556 3.8465 8.2593 7.0709 1.8076 0.5008 5.1205 1.2713 0.7274 2.3166 5.0278 8.9324 1.7288 0.7456 13.2260 3.7265 2.6792 10.2067 10.7521 0.2925 1.8250 11.3560 9.6114 34.0586 5.6332 10.9922 7.4948 14.1505 155.7278 75.9531 33.2670 5.7470 29.4797 33.4461 47.1598 2.1251 102.1280 307.8838 1.7892 160.4092 86.8855 14.6182 10.8861 18.0941 0.1150 4.8996 184.8158 63.2898 3.6169 37.2535 177.5133 69.6865 5.2811 1.6825 41.3536 73.2591 52.7052 10.7084 13.2632 309.2602 205.8794 12.5006 204.9205 37.4001 27.6678 85.4747 19.8459 66.1591 23.9000 50.4358 61.8042 66.9084 15.7371 24.4037 41.3548 6.0385 23.5018 27.8326 22.8634 9.3044 25.9627 66.3232 19.5361 110.1585 47.5351 168.3468 443.7661 43.8618 14.1442 14.5693 4.7804 36.1321 1.1483 4.3980 16.6264 0.8492 3.4559 21.2149 2.3139 5.6875 6.1071 1.9298 4.5389 0.8386 1.6503 369.6593
temp: 298.150 k
press: 1.00000 atm
elementType: 6 6 6 6 6 6 6 6 8 6 6 8 6 1 1 8 1 1 1 6 1 1 8 1 1 1 1 6 1 1 1 8 6 1 1 1 1 1
symmnumber: 1
zpe: 844464.9 jmol-1
zpe.correction: 0.321640 hartree
zpe.thermalcorrener: 0.339771 hartree
zpe.thermalcorrenthalpy: 0.340715 hartree
zpe.thermalcorrgfe: 0.275532 hartree
zpe.sumelectzpe: -920.386830 hartree
zpe.sumelectthermal: -920.368699 hartree
zpe.sumelectthermalent: -920.367755 hartree
zpe.sumelectthermalfe: -920.432938 hartree
dipole: -20.2630 2.9504 -5.1863
dipole: 21.1233
quadrupole: -7.4871 -102.6970 -106.1203
quadrupole: -29.8629 18.7633 5.3398
quadrupole: 64.6144 -30.5955 -34.0188 -29.8629 18.7633 5.3398
hfenergy: -920.7084699 hartree
pointgroup: C01 [X(C14H19O5)]
dipole: -7.6419136 -0.8819244 3.1445798 debye
polarizability: 247.8223099|13.4010811|227.4142146|4.1500503|-12.3333193|150.8222953 unknown
InChI: InChI=1S/C14H19O5/c1-14(13(15)19-12(17-3)9-18-14)8-10-5-4-6-11(7-10)16-2/h4-7,12,17H,8-9H2,1-3H3
charge 1 multiplicity 1
38 atoms
C  2.70781597 -2.40214377 -0.00962886
C  3.83062465 -1.61569029 0.18728273
C  3.75391306 -0.23286522 -0.01022334
C  2.54855168 0.34484065 -0.40809488
C  1.41715168 -0.45563029 -0.6012313
C  1.49765346 -1.83014821 -0.40128016
C  0.1186353 0.1871034 -1.02068087
C  -0.8139367 0.50027924 0.169779
O  -1.16114629 -0.75063583 0.7577551
C  -2.37263366 -0.71542626 1.46970511
C  -3.44878766 -0.57913677 0.41608559
O  -3.22884895 0.47837579 -0.44381669
C  -2.03991603 1.18418338 -0.43263487
H  2.77575095 -3.47371543 0.13929738
H  4.77932555 -2.0445632 0.4876153
O  4.8971156 0.46196224 0.2031265
H  2.47194538 1.41185675 -0.57683889
H  0.31406583 1.12792101 -1.53826467
H  -0.42502888 -0.47216006 -1.70262707
C  -0.17134976 1.43113949 1.19378257
H  -2.42120756 0.12005641 2.18012086
H  -2.47767716 -1.65618423 2.00771042
O  -2.02301066 2.25012525 -0.95487361
H  0.16200474 2.34788818 0.70567041
H  0.68721155 0.92649196 1.63671745
H  -0.87099849 1.7015302 1.98671717
H  0.6205422 -2.44778054 -0.55285762
C  4.8589284 1.869887 0.02769122
H  5.86007342 2.22733722 0.25921373
H  4.14104598 2.33373531 0.71092809
H  4.60876727 2.1341416 -1.00394183
O  -4.76642406 -0.23983884 1.02673432
C  -5.37243416 -1.23650863 1.93560931
H  -4.81275182 -1.25216473 2.86734186
H  -6.39959538 -0.91362973 2.07303094
H  -5.3221213 -2.18256387 1.40305119
H  -3.65811616 -1.49419335 -0.13583739
H  -4.77151401 0.67077439 1.39565548
