program: Gaussian 09
title: prusses
version: ES64L-G09RevD.01
basis: 6-311G(d)
method: UPBE1PBE
operation: FOpt
keyword: #p
keyword: opt
keyword: upbe1pbe/6-311G(d)
keyword: nosymm
keyword: gfinput
keyword: IOP(6/7=3)
keyword: gfoldprint
keyword: pop=no
keyword: scf=(tight,QC,MaxCycle=120)
title: #p opt upbe1pbe/6-311G(d) nosymm gfinput IOP(6/7=3) gfoldprint pop=no
basis: NPDir=0 NMtPBC= 1 NCelOv= 1 NCel= 1 NClECP= 1 NCelD= 1
basis: NCelK= 1 NCelE2= 1 NClLst= 1 CellRange= 0.0.
basis: One-electron integrals computed using PRISM.
basis: PrsmSu: requested number of processors reduced to: 9 ShMem 1 Linda.
basis: NBasis= 378 RedAO= T EigKep= 1.31D-04 NBF= 378
basis: NBsUse= 378 1.00D-06 EigRej= -1.00D+00 NBFU= 378
converged: YES YES YES YES
dipole: 0.0000 0.0000 0.0000
dipole: 0.0000
quadrupole: -78.7103 -141.6568 -110.9001
quadrupole: 11.9674 -0.0001 -0.0004
quadrupole: 31.7121 -31.2344 -0.4777 11.9674 -0.0001 -0.0004
hfenergy: -979.6118301 hartree
pointgroup: C01 [X(C12H6N4O4)]
dipole: 0. 0. -0.0000031 debye
InChI: InChI=1S/C12H6N4O4/c1-5-3-7-9(13-5)12(16(19)20)8-4-6(2)14-10(8)11(7)15(17)18/h3-4H,1-2H2
charge 0 multiplicity 3
26 atoms
C  0.29140522 0.06731927 -0.00000128
C  1.64806724 -0.01467581 -0.0000008
N  2.44434721 1.12507988 -0.00000507
C  2.44938111 -1.21161659 0.00000392
C  3.68716528 0.69755542 -0.00000322
C  3.76648161 -0.79468175 0.00000254
C  4.87762316 1.46813863 -0.00000659
C  4.99649164 -1.46813863 0.00000587
C  6.10763319 0.79468175 -0.00000316
C  6.18694952 -0.69755542 0.00000261
C  7.42473369 1.21161659 -0.00000445
N  7.42976759 -1.12507988 0.00000457
C  8.22604756 0.01467581 0.00000033
C  9.58270958 -0.06731927 0.0000009
H  2.08904458 -2.2266764 0.0000079
H  7.78507022 2.2266764 -0.00000842
H  -0.18945258 1.03826462 -0.00000509
H  -0.32689956 -0.82275172 0.00000207
H  10.20101436 0.82275172 -0.00000243
H  10.06356738 -1.03826462 0.00000477
N  4.84130072 2.93361878 -0.00001231
N  5.03281408 -2.93361878 0.00001161
O  3.76433855 3.47951706 0.00001251
O  5.91670379 3.50897853 0.00001445
O  3.95741101 -3.50897853 -0.00001146
O  6.10977625 -3.47951706 -0.00000976
