program: Gaussian 09
title: prusses
version: ES64L-G09RevD.01
basis: 6-311G(d)
method: UPBE1PBE
operation: FOpt
keyword: #p
keyword: opt
keyword: upbe1pbe/6-311G(d)
keyword: nosymm
keyword: gfinput
keyword: IOP(6/7=3)
keyword: gfoldprint
keyword: pop=no
keyword: scf=tight
title: #p opt upbe1pbe/6-311G(d) nosymm gfinput IOP(6/7=3) gfoldprint pop=no
basis: NPDir=0 NMtPBC= 1 NCelOv= 1 NCel= 1 NClECP= 1 NCelD= 1
basis: NCelK= 1 NCelE2= 1 NClLst= 1 CellRange= 0.0.
basis: One-electron integrals computed using PRISM.
basis: NBasis= 318 RedAO= T EigKep= 1.30D-04 NBF= 318
basis: NBsUse= 318 1.00D-06 EigRej= -1.00D+00 NBFU= 318
converged: YES YES YES YES
dipole: 0.0000 0.0000 0.0000
dipole: 0.0000
quadrupole: -84.4891 -68.6408 -99.0639
quadrupole: 11.0922 0.0000 0.0000
quadrupole: -0.4245 15.4238 -14.9993 11.0922 0.0000 0.0000
hfenergy: -681.5787831 hartree
pointgroup: C01 [X(C12H10N4)]
dipole: 0. 0. 0. debye
InChI: InChI=1S/C12H10N4/c1-5-3-7-9(13)12-8(4-6(2)16-12)10(14)11(7)15-5/h3-4H,1-2,13-14H2
charge 0 multiplicity 3
26 atoms
C  0.29587607 0.12191853 -0.00000016
C  1.65430866 0.03925354 -0.00000006
N  2.47533748 1.15747273 0.00000026
C  2.44425279 -1.17868276 0.00000013
C  3.70995783 0.68357375 0.00000007
C  3.75823242 -0.78712709 0.0000001
C  4.8755468 1.48220117 -0.0000
C  4.998568 -1.48220117 0.00000004
C  6.11588238 0.78712709 -0.00000007
C  6.16415697 -0.68357375 -0.00000004
C  7.42986201 1.17868276 -0.0000001
N  7.39877732 -1.15747273 -0.00000018
C  8.21980614 -0.03925354 -0.00000001
C  9.57823873 -0.12191853 0.00000003
H  2.03696613 -2.18192941 0.00000011
H  7.83714867 2.18192941 -0.00000009
H  -0.1910093 1.08992874 -0.00000011
H  -0.32311909 -0.76788734 -0.00000017
H  10.19723389 0.76788734 0.00000004
H  10.0651241 -1.08992874 0.00000001
N  4.75210408 2.82644413 0.00000004
N  5.12201072 -2.82644413 0.00000001
H  3.82307035 3.2122534 0.0000001
H  5.54448931 3.43938949 0.00000001
H  4.32962549 -3.43938949 0.00000007
H  6.05104445 -3.2122534 -0.00000004
