program: Gaussian 09
title: prusses
version: ES64L-G09RevD.01
basis: 6-311G(d)
method: UPBE1PBE
operation: FOpt
keyword: #p
keyword: opt
keyword: upbe1pbe/6-311G(d)
keyword: nosymm
keyword: gfinput
keyword: IOP(6/7=3)
keyword: gfoldprint
keyword: pop=no
keyword: scf=tight
title: #p opt upbe1pbe/6-311G(d) nosymm gfinput IOP(6/7=3) gfoldprint pop=no
basis: NPDir=0 NMtPBC= 1 NCelOv= 1 NCel= 1 NClECP= 1 NCelD= 1
basis: NCelK= 1 NCelE2= 1 NClLst= 1 CellRange= 0.0.
basis: One-electron integrals computed using PRISM.
basis: NBasis= 384 RedAO= T EigKep= 1.02D-04 NBF= 384
basis: NBsUse= 384 1.00D-06 EigRej= -1.00D+00 NBFU= 384
converged: YES YES YES YES
dipole: 0.0000 0.0000 0.0000
dipole: 0.0000
quadrupole: -77.3695 -139.2135 -114.7253
quadrupole: 0.0000 0.0000 -0.0001
quadrupole: 33.0666 -28.7774 -4.2892 0.0000 0.0000 -0.0001
hfenergy: -947.5581726 hartree
pointgroup: C01 [X(C14H8N2O4)]
dipole: 0.0000039 0. -0.0000026 debye
InChI: InChI=1S/C14H8N2O4/c1-7-3-9-10(4-7)14(16(19)20)12-6-8(2)5-11(12)13(9)15(17)18/h3-6H,1-2H2
charge 0 multiplicity 3
28 atoms
C  0.19233462 0.00000025 -0.0000001
C  1.55051423 0.00000015 -0.00000016
C  2.40085959 1.16665374 -0.00000096
C  2.40085944 -1.16665356 0.00000054
C  3.71754331 0.74835301 -0.00000073
C  3.71754325 -0.74835304 0.00000026
C  4.93705732 1.45323983 -0.00000133
C  4.93705732 -1.45323983 0.00000078
C  6.15657134 0.74835303 -0.00000072
C  6.15657128 -0.748353 0.00000026
C  7.47325514 1.16665357 -0.00000094
C  7.473255 -1.16665375 0.00000055
C  8.32360039 -0.00000015 -0.00000017
C  9.68178001 -0.00000025 -0.00000012
H  2.05540291 2.18675767 -0.00000163
H  2.0554026 -2.18675732 0.00000121
H  7.81871192 2.18675741 -0.0000016
H  7.81871161 -2.18675776 0.00000122
H  -0.37172244 0.92679293 -0.00000069
H  -0.37172257 -0.92679233 0.00000049
H  10.24583718 0.92679236 -0.0000007
H  10.24583705 -0.92679296 0.00000048
N  4.93705717 2.91010678 -0.00000222
N  4.93705801 -2.91010678 0.00000171
O  3.86266686 3.48304886 0.00000358
O  6.01144742 3.48304885 0.00000359
O  3.86266835 -3.48304974 -0.0000013
O  6.01144891 -3.48304797 -0.00000129
