program: Gaussian 09
title: prusses
version: ES64L-G09RevD.01
basis: 6-311G(d)
method: UPBE1PBE
operation: FOpt
keyword: #p
keyword: opt
keyword: upbe1pbe/6-311G(d)
keyword: nosymm
keyword: gfinput
keyword: IOP(6/7=3)
keyword: gfoldprint
keyword: pop=no
keyword: scf=tight
title: #p opt upbe1pbe/6-311G(d) nosymm gfinput IOP(6/7=3) gfoldprint pop=no
basis: NPDir=0 NMtPBC= 1 NCelOv= 1 NCel= 1 NClECP= 1 NCelD= 1
basis: NCelK= 1 NCelE2= 1 NClLst= 1 CellRange= 0.0.
basis: One-electron integrals computed using PRISM.
basis: PrsmSu: requested number of processors reduced to: 5 ShMem 1 Linda.
basis: NBasis= 1048 RedAO= T EigKep= 8.75D-05 NBF= 1048
basis: NBsUse= 1048 1.00D-06 EigRej= -1.00D+00 NBFU= 1048
converged: YES YES YES YES
dipole: 0.0000 0.0000 0.0000
dipole: 0.0000
quadrupole: -266.7557 -325.5019 -353.5707
quadrupole: -0.0001 0.0002 -9.2985
quadrupole: 48.5204 -10.2258 -38.2946 -0.0001 0.0002 -9.2985
hfenergy: -5546.5316446 hartree
pointgroup: C01 [X(C38H16Cl8N2O4)]
dipole: 0.0000018 -0.0000051 0.0000153 debye
InChI: InChI=1S/C38H16Cl8N2O4/c39-23-5-1-6-24(40)33(23)31(34-25(41)7-2-8-26(34)42)17-13-19-20(14-17)38(48(51)52)22-16-18(15-21(22)37(19)47(49)50)32(35-27(43)9-3-10-28(35)44)36-29(45)11-4-12-30(36)46/h1-16H
charge 0 multiplicity 3
68 atoms
C  1.55565349 0.00000012 0.00000432
C  2.40169161 1.1462473 0.20658394
C  2.40169136 -1.1462474 -0.20657449
C  3.71954 0.73460324 0.13987312
C  3.71953986 -0.73460366 -0.13986347
C  4.93706288 1.4249711 0.28323065
C  4.93706263 -1.42497181 -0.28322067
C  6.15458599 0.7346034 0.13987181
C  6.15458587 -0.73460401 -0.13986343
C  7.47243485 1.14624756 0.20658182
C  7.4724347 -1.14624806 -0.20657507
C  8.31847238 -0.00000014 0.00000249
H  2.06020199 2.14500128 0.41531745
H  2.06020148 -2.14500137 -0.41530771
H  7.81392538 2.14500202 0.41531305
H  7.81392507 -2.14500253 -0.41530652
N  4.93706243 2.85709412 0.55449536
N  4.93706194 -2.85709478 -0.55448566
O  3.86307832 3.41995403 0.66322459
O  6.01104698 3.41995515 0.66321929
O  3.86307776 -3.41994954 -0.66324091
O  6.01104638 -3.41995079 -0.66323658
C  0.17641143 0.00000027 0.0000039
C  9.6977144 0.0000 0.00000118
C  -0.56757234 1.27988741 -0.04832975
C  -0.56757224 -1.27988697 0.0483336
C  10.44169553 1.27989008 -0.04829821
C  10.44169571 -1.27989 0.04829893
C  -0.37336403 2.22378642 -1.07800448
C  -1.51538283 1.62748799 0.92983696
C  -0.37336242 -2.22379101 1.07800341
C  -1.51538258 -1.62748339 -0.92983451
C  10.24744302 2.22383847 -1.077919
C  11.38953598 1.62745175 0.92985356
C  10.24744391 -2.22383941 1.07791887
C  11.38953501 -1.6274509 -0.92985419
C  -1.06951131 3.42251117 -1.12103854
C  -2.21681121 2.8232394 0.89914229
C  -1.06950927 -3.42251621 1.12103211
C  -2.21681099 -2.82323491 -0.89914496
C  10.94358073 3.42256993 -1.12092099
C  12.09095858 2.82320741 0.89918878
C  10.94358148 -3.42257102 1.12091904
C  12.09095765 -2.82320659 -0.89919114
H  -0.88871202 4.1085016 -1.93970837
H  -2.92456511 3.04266933 1.68940907
H  -0.88870843 -4.10851102 1.93969794
H  -2.92456531 -3.04266125 -1.68941236
H  10.76274177 4.10860165 -1.93954751
H  12.79873956 3.04260384 1.68944066
H  10.76274287 -4.10860371 1.93954483
H  12.79873783 -3.04260234 -1.68944392
C  -1.99082978 3.72114493 -0.13031509
C  -1.99082878 -3.7211452 0.13030814
C  11.86493595 3.72116014 -0.13021857
C  11.86493593 -3.72116025 0.13021561
H  -2.53486699 4.65911844 -0.16164889
H  -2.53486562 -4.65911907 0.16163774
H  12.40896597 4.65913872 -0.16152679
H  12.40896584 -4.65913894 0.16152238
Cl 0.69902255 1.90722723 -2.40413452
Cl -1.80819508 0.58397509 2.28289804
Cl 0.69902905 -1.9072401 2.40413146
Cl -1.80819527 -0.58396345 -2.28289011
Cl 9.17497819 1.9073526 -2.40400337
Cl 11.68240311 0.58387658 2.28285464
Cl 9.1749787 -1.90735546 2.40400338
Cl 11.68240069 -0.58387445 -2.28285461
