program: Gaussian 09
title: prusses
version: ES64L-G09RevD.01
basis: 6-311G(d)
method: UPBE1PBE
operation: FOpt
keyword: #p
keyword: opt
keyword: upbe1pbe/6-311G(d)
keyword: nosymm
keyword: gfinput
keyword: IOP(6/7=3)
keyword: gfoldprint
keyword: pop=no
keyword: scf=tight
title: #p opt upbe1pbe/6-311G(d) nosymm gfinput IOP(6/7=3) gfoldprint pop=no
basis: NPDir=0 NMtPBC= 1 NCelOv= 1 NCel= 1 NClECP= 1 NCelD= 1
basis: NCelK= 1 NCelE2= 1 NClLst= 1 CellRange= 0.0.
basis: One-electron integrals computed using PRISM.
basis: PrsmSu: requested number of processors reduced to: 5 ShMem 1 Linda.
basis: NBasis= 1012 RedAO= T EigKep= 5.90D-05 NBF= 1012
basis: NBsUse= 1012 1.00D-06 EigRej= -1.00D+00 NBFU= 1012
converged: YES YES YES YES
dipole: 0.0000 0.0000 0.0000
dipole: 0.0000
quadrupole: -256.3899 -319.7444 -345.9796
quadrupole: 0.0000 0.0000 -9.0031
quadrupole: 50.9814 -12.3731 -38.6083 0.0000 0.0000 -9.0031
hfenergy: -5322.1577929 hartree
pointgroup: C01 [X(C40H16Cl8N2)]
dipole: 0.0000026 0.0000006 -0.0000016 debye
InChI: InChI=1S/C40H16Cl8N2/c41-27-5-1-6-28(42)37(27)35(38-29(43)7-2-8-30(38)44)19-13-21-22(14-19)26(18-50)24-16-20(15-23(24)25(21)17-49)36(39-31(45)9-3-10-32(39)46)40-33(47)11-4-12-34(40)48/h1-16H
charge 0 multiplicity 3
66 atoms
C  1.56262276 -0.00000027 0.00000112
C  2.41546509 1.14721146 0.21015905
C  2.41546503 -1.14721208 -0.21015661
C  3.72645524 0.72790718 0.14106119
C  3.72645522 -0.72790787 -0.14105872
C  4.93705798 1.43487176 0.2839976
C  4.93705795 -1.43487247 -0.28399519
C  6.14766025 0.72790684 0.14106092
C  6.14766023 -0.72790753 -0.14105873
C  7.45865032 1.1472119 0.21015875
C  7.45865032 -1.14721253 -0.2101569
C  8.3114925 -0.00000027 0.00000068
H  2.07676297 2.15201685 0.42150205
H  2.07676286 -2.15201745 -0.42149966
H  7.79735158 2.15201829 0.42150161
H  7.79735157 -2.1520189 -0.42149989
C  4.93707002 2.82709145 0.55167191
C  4.93706994 -2.82709217 -0.55166948
N  4.93705466 3.96257067 0.77058077
N  4.93705457 -3.96257139 -0.77057831
C  0.1836062 -0.0000001 0.00000068
C  9.69050893 -0.00000009 0.00000005
C  -0.56061048 1.2804386 -0.03985239
C  -0.5606109 -1.28043861 0.03985264
C  10.4347254 1.2804388 -0.03985083
C  10.43472585 -1.28043875 0.03985038
C  -0.37011305 2.22951611 -1.06547924
C  -1.50618635 1.62361764 0.94213627
C  -0.37011488 -2.22951655 1.06547935
C  -1.50618578 -1.62361698 -0.94213718
C  10.24422521 2.22951941 -1.06547428
C  11.38030292 1.62361538 0.94213708
C  10.2442273 -2.22951902 1.06547443
C  11.38030228 -1.62361539 -0.94213858
C  -1.06665485 3.42851783 -1.10095268
C  -2.20883986 2.81890746 0.91872187
C  -1.06665715 -3.42851804 1.1009516
C  -2.20883973 -2.81890656 -0.91872399
C  10.94076617 3.42852167 -1.10094538
C  12.08295582 2.81890559 0.91872484
C  10.94076868 -3.42852105 1.10094511
C  12.08295556 -2.81890538 -0.91872679
H  -0.88856198 4.11826588 -1.91704529
H  -2.91540902 3.03364714 1.71128957
H  -0.8885654 -4.11826644 1.91704415
H  -2.9154081 -3.0336457 -1.71129254
H  10.76267068 4.11827246 -1.91703509
H  12.78952643 3.03364324 1.71129177
H  10.76267448 -4.11827156 1.91703535
H  12.78952523 -3.03364311 -1.71129455
C  -1.98586268 3.7220258 -0.10677237
C  -1.98586399 -3.72202534 0.10677018
C  11.85997602 3.72202697 -0.10676616
C  11.85997733 -3.72202645 0.10676482
H  -2.53085558 4.65956779 -0.13259899
H  -2.53085724 -4.65956715 0.13259587
H  12.40496815 4.65956945 -0.13259087
H  12.40496979 -4.65956875 0.1325892
Cl 0.70032531 1.92078996 -2.39541664
Cl -1.79600226 0.57283959 2.29022288
Cl 0.70032213 -1.92079126 2.39541803
Cl -1.79599985 -0.57283823 -2.29022366
Cl 9.17378238 1.9207978 -2.39540912
Cl 11.67012229 0.57283323 2.29021975
Cl 9.17378632 -1.92079708 2.39541067
Cl 11.67011962 -0.57283372 -2.29022205
