program: Gaussian 09
title: prusses
version: ES64L-G09RevD.01
basis: 6-311G(d)
method: UPBE1PBE
operation: FOpt
keyword: #p
keyword: opt
keyword: upbe1pbe/6-311G(d)
keyword: nosymm
keyword: gfinput
keyword: IOP(6/7=3)
keyword: gfoldprint
keyword: pop=no
keyword: scf=tight
title: #p opt upbe1pbe/6-311G(d) nosymm gfinput IOP(6/7=3) gfoldprint pop=no
basis: NPDir=0 NMtPBC= 1 NCelOv= 1 NCel= 1 NClECP= 1 NCelD= 1
basis: NCelK= 1 NCelE2= 1 NClLst= 1 CellRange= 0.0.
basis: One-electron integrals computed using PRISM.
basis: PrsmSu: requested number of processors reduced to: 6 ShMem 1 Linda.
basis: NBasis= 1018 RedAO= T EigKep= 1.53D-04 NBF= 1018
basis: NBsUse= 1018 1.00D-06 EigRej= -1.00D+00 NBFU= 1018
converged: YES YES YES YES
dipole: 0.0000 0.0002 -0.0001
dipole: 0.0002
quadrupole: -286.4590 -272.5366 -347.7223
quadrupole: -13.3280 -1.2840 -0.3964
quadrupole: 15.7803 29.7027 -45.4830 -13.3280 -1.2840 -0.3964
hfenergy: -5323.3932328 hartree
pointgroup: C01 [X(C40H18Cl8N2)]
dipole: -0.0000137 0.000069 -0.0000589 debye
InChI: InChI=1S/C40H18Cl8N2/c41-23-5-1-6-24(42)35(23)33(36-25(43)7-2-8-26(36)44)19-13-15-21-31(17-19)49-40-22-16-14-20(18-32(22)50-39(21)40)34(37-27(45)9-3-10-28(37)46)38-29(47)11-4-12-30(38)48/h1-18H
charge 0 multiplicity 3
68 atoms
C  -0.01051692 -0.10086955 -0.2166118
C  1.39456176 0.07753408 0.21670711
C  -0.53702217 1.22767004 -0.26991631
N  1.74404818 1.31336465 0.41692933
N  -0.36001194 -1.33670404 -0.41680682
C  1.92108618 -1.25100335 0.26995317
C  0.57347849 2.05192592 0.12029128
C  0.81056997 -2.0752615 -0.12022209
C  -1.76276918 1.80968071 -0.58160417
C  0.45514763 3.41198972 0.18435282
C  3.14683615 -1.83301925 0.58159838
C  0.92890989 -3.43532368 -0.18431499
C  -0.80006633 4.02033043 -0.12254184
C  -1.89002767 3.18186353 -0.4995841
C  3.27409289 -3.20520399 0.49957535
C  2.18413521 -4.04366835 0.12253893
H  1.30003592 4.0143241 0.49771894
H  0.08402296 -4.03765523 -0.49768659
C  -0.95637027 5.42441712 -0.05589136
C  2.34042552 -5.44776542 0.05591683
H  -2.83499682 3.64580924 -0.75912029
H  4.21907814 -3.66912467 0.75909211
H  -2.60272446 1.19532276 -0.88896338
H  3.9868083 -1.21867582 0.88894278
C  0.22594813 6.31088316 -0.06713828
C  -2.3032818 6.02739249 0.0243616
C  1.15810525 -6.33422644 0.06711931
C  3.68734257 -6.05073935 -0.02430026
C  1.18820329 6.26696243 -1.09874688
C  0.46265417 7.26377451 0.94044692
C  -2.75298176 6.98931025 -0.89844026
C  -3.22060001 5.68706245 1.04157522
C  0.19569606 -6.29018739 1.09858545
C  0.92151351 -7.28719588 -0.94042344
C  4.1371076 -7.01251902 0.89862075
C  4.60459796 -5.71056409 -1.04161806
C  2.29653142 7.09966996 -1.11730148
C  1.56394803 8.10700205 0.93256612
C  -4.01013552 7.57111545 -0.82411845
C  -4.48187778 6.25668707 1.12609515
C  -0.91265162 -7.12287082 1.11705048
C  -0.17980195 -8.13039462 -0.93262742
C  5.39429287 -7.59426636 0.82435771
C  5.86589467 -6.28015096 -1.12609869
C  2.48305233 8.02153043 -0.09961946
C  -4.87574433 7.20104107 0.19140384
C  -1.09904606 -8.04481779 0.09942134
C  6.25984687 -7.22432063 -0.19125786
Cl 0.99751472 5.20264474 -2.45503321
Cl -0.60331996 7.38645182 2.30381158
Cl -1.75563515 7.45452727 -2.23938882
Cl -2.78768731 4.57460946 2.29999776
Cl 0.38616695 -5.22571073 2.4547744
Cl 1.98759544 -7.40991492 -2.3036982
Cl 3.13989463 -7.47749878 2.23975404
Cl 4.17154368 -4.59841067 -2.30025837
H  2.99821344 7.02706718 -1.93959208
H  1.69626019 8.81260784 1.74400089
H  -4.30164276 8.29943212 -1.57140508
H  -5.14031867 5.96495397 1.93554452
H  -1.61445905 -7.05016987 1.93922463
H  -0.31203779 -8.83604009 -1.74404091
H  5.68586804 -8.32243276 1.57176382
H  6.52428544 -5.98853105 -1.93562959
H  3.3484241 8.67564686 -0.11183014
H  -5.86097133 7.65057613 0.25605305
H  -1.96444371 -8.69890261 0.11155437
H  7.24509408 -7.67381788 -0.25586931
