program: Gaussian 09
title: prusses
version: ES64L-G09RevD.01
basis: 6-311G(d)
method: UPBE1PBE
operation: FOpt
keyword: #p
keyword: opt
keyword: upbe1pbe/6-311G(d)
keyword: nosymm
keyword: gfinput
keyword: IOP(6/7=3)
keyword: gfoldprint
keyword: pop=no
keyword: scf=tight
title: #p opt upbe1pbe/6-311G(d) nosymm gfinput IOP(6/7=3) gfoldprint pop=no
basis: NPDir=0 NMtPBC= 1 NCelOv= 1 NCel= 1 NClECP= 1 NCelD= 1
basis: NCelK= 1 NCelE2= 1 NClLst= 1 CellRange= 0.0.
basis: One-electron integrals computed using PRISM.
basis: NBasis= 276 RedAO= T EigKep= 2.06D-04 NBF= 276
basis: NBsUse= 276 1.00D-06 EigRej= -1.00D+00 NBFU= 276
converged: YES YES YES YES
dipole: 0.0000 0.0000 0.0000
dipole: 0.0000
quadrupole: -63.4519 -75.7402 -84.7454
quadrupole: -12.6416 0.0000 0.0000
quadrupole: 11.1939 -1.0944 -10.0996 -12.6416 0.0000 0.0000
hfenergy: -570.9359302 hartree
pointgroup: C01 [X(C12H8N2)]
dipole: 0. 0. 0. debye
InChI: InChI=1S/C12H8N2/c1-7-3-9-5-12-10(4-8(2)14-12)6-11(9)13-7/h3-6H,1-2H2
charge 0 multiplicity 3
22 atoms
C  0.36675865 -0.04819798 0.00000006
C  9.64355084 0.04819798 0.00000011
C  1.72589731 0.02419966 0.00000002
H  -0.24686599 0.84522276 0.00000011
H  -0.12280937 -1.01475127 0.00000012
N  2.52185396 -1.11824601 -0.00000003
C  2.53665555 1.22272155 -0.00000009
C  3.76913657 -0.68186374 -0.00000009
C  3.84927584 0.80251034 -0.00000002
C  4.93047844 -1.4712627 -0.00000008
C  5.07983105 1.4712627 0.00000002
C  6.16103364 -0.80251033 -0.00000005
C  6.24117292 0.68186374 0.00000002
C  7.47365393 -1.22272155 0.0000
N  7.48845553 1.11824601 -0.00000004
C  8.28441218 -0.02419966 0.00000004
H  10.25717548 -0.84522276 0.00000004
H  10.13311885 1.01475127 -0.0000
H  2.16619159 2.2396658 -0.00000011
H  4.85143701 -2.55325434 -0.00000007
H  5.15887248 2.55325434 0.00000002
H  7.84411789 -2.2396658 0.00000002
