program: Gaussian 09
title: 000049973
version: EM64L-G09RevD.01
frameworkgroup: C1[X(C12H4Br4O)]
method: RPBEPBE
basis: SDD
operation: Freq
keyword: #p
keyword: freq=noraman
keyword: PBEPBE/SDD
title: #p freq=noraman PBEPBE/SDD
converged: NO YES YES YES
title: Mulliken charges:
elementType: Br Br Br Br O C C C C C C C C C C C C H H H H
charge: 0.065990 0.065990 0.080388 0.080386 -0.248415 0.225782 0.225776 0.184110 0.184115 -0.326463 -0.326465 -0.301150 -0.301150 -0.190392 -0.190397 -0.172313 -0.172305 0.271385 0.271384 0.286872 0.286872
chargesum: 0.00000
title: Mulliken charges with hydrogens summed into heavy atoms:
elementType: Br Br Br Br O C C C C C C C C C C C C
charge: 0.065990 0.065990 0.080388 0.080386 -0.248415 0.225782 0.225776 0.184110 0.184115 -0.055078 -0.055081 -0.014278 -0.014279 -0.190392 -0.190397 -0.172313 -0.172305
polarizability: 3.99309508e+02 1.00186438e-02 1.95621228e+02 2.96012954e-03 -4.77377422e-03 6.70776906e+01
1716.lowfreq: -1.8989 -0.0006 -0.0004 -0.0002 1.1182 4.6145 31.8561 35.9184 70.8250
frequency: 31.8525 35.9019 70.8250 103.5683 117.1596 125.3935 126.6554 169.1051 172.4029 230.5135 240.4062 250.7474 312.1075 338.2889 367.1102 380.1316 404.9724 431.9579 438.8210 557.4594 560.7587 610.7000 623.7136 634.3453 660.6371 698.2953 704.7649 746.0174 770.0429 853.5608 857.4114 865.3162 868.9551 883.6679 891.5475 997.9516 1070.9056 1075.0607 1131.9102 1160.5171 1226.3111 1226.3165 1245.6508 1348.9391 1353.7342 1369.4403 1379.4973 1424.4360 1450.4547 1561.3148 1586.5468 1592.1002 1634.1122 3171.0289 3171.8349 3186.5394 3186.7790
redmass: 56.4966 15.5862 23.2813 6.8645 64.3252 60.5679 9.2513 31.9815 46.0778 4.8317 9.4476 17.5410 11.6940 14.1818 9.8407 8.8187 6.7626 3.0441 3.0744 5.1677 7.6365 10.5113 8.5679 7.8263 8.8760 8.2827 4.2971 3.8403 6.9619 10.2193 8.1584 1.4490 1.4352 1.4053 1.5660 7.1505 1.8644 1.9592 8.0472 7.6609 1.2898 1.4154 3.9250 5.4651 3.5044 6.8838 7.7930 3.2046 4.8028 10.3643 9.7887 8.6017 9.0095 1.0930 1.0930 1.0936 1.0939
irintensity: 0.0000 0.0251 0.0082 0.0382 0.0121 0.5190 0.0000 0.0105 0.0028 0.0000 0.1389 0.1820 0.0496 15.2912 5.0104 0.0000 3.1747 26.3728 0.0000 0.1633 5.1899 0.0161 35.9322 0.0000 0.1298 16.3192 0.0946 0.0000 15.8858 66.1824 108.8847 0.0000 15.9817 72.6788 0.0000 12.7361 140.1233 5.5385 27.3698 33.6157 4.3863 0.3915 11.4537 80.4409 24.5850 43.7974 62.7328 211.6839 2.6246 2.2256 1.7809 46.2789 10.6532 0.1427 0.2822 0.0710 1.1909
temp: 298.150 k
press: 1.00000 atm
elementType: 35 35 35 35 8 6 6 6 6 6 6 6 6 6 6 6 6 1 1 1 1
symmnumber: 1
zpe: 315135.2 jmol-1
zpe.correction: 0.120029 hartree
zpe.thermalcorrener: 0.135169 hartree
zpe.thermalcorrenthalpy: 0.136113 hartree
zpe.thermalcorrgfe: 0.073476 hartree
zpe.sumelectzpe: -587.575906 hartree
zpe.sumelectthermal: -587.560766 hartree
zpe.sumelectthermalent: -587.559822 hartree
zpe.sumelectthermalfe: -587.622458 hartree
dipole: 0.0001 0.2289 -0.0001
dipole: 0.2289
quadrupole: -144.9284 -126.2311 -138.0852
quadrupole: 0.0001 0.0001 0.0000
quadrupole: -8.5135 10.1838 -1.6703 0.0001 0.0001 0.0000
hfenergy: -587.6959347 hartree
pointgroup: C01 [X(C12H4Br4O1)]
dipole: 0.0000286 -0.0900719 0.0000224 debye
dipolederiv: -0.3329906 -0.2657168 0.000011 -0.4201895 -0.3174715 -0.0000139 -0.0000179 -0.0000736 0.010527 -0.3332045 0.2653768 -0.0000176 0.4199728 -0.3178449 -0.0000215 0.0000024 -0.0000392 0.0105278 -0.7156059 0.1943191 0.000015 0.2849501 -0.0562844 0.0000036 0.0000139 0.0000304 0.0184928 -0.7155579 -0.1941928 0.000012 -0.2849692 -0.0562602 0.0000136 0.0000139 -0.0000711 0.0184902 -1.529447 -0.0000371 0.0000086 0.000014 -0.4926299 -0.0000116 -0.0000132 -0.0001427 -0.1440485 0.1727007 0.1418789 -0.0000029 -0.1979748 -0.1103747 0.0000202 0.0000174 0.0000222 0.0115175 0.172695 -0.1414466 0.0000134 0.1980469 -0.1107526 0.0000016 -0.0000206 -0.0001002 0.0115127 0.7151267 0.2183144 -0.0000117 0.7183686 0.2852568 -0.0000015 -0.0000267 -0.0000559 0.0738284 0.715221 -0.2184142 -0.0000057 -0.7184135 0.2853787 0.0000088 0.0000297 0.0001782 0.0738343 -0.0221676 -0.2018225 -0.0000049 -0.0361939 -0.0989078 -0.0000062 -0.0000131 -0.00005 -0.0742461 -0.0222489 0.2011544 -0.0000091 0.0361466 -0.0997527 -0.0000179 0.0000117 0.000063 -0.074243 -0.3579099 0.0014338 0.000012 -0.0501224 -0.051268 0.0000028 0.0000135 0.000062 -0.0886521 -0.3579951 -0.0012708 0.0000011 0.0501975 -0.0514226 -0.000002 0.0000006 -0.0000914 -0.0886593 0.1687611 0.7914738 -0.0000061 0.8885033 0.4904064 0.0000187 0.0000387 0.0001388 -0.1047481 0.1690433 -0.7912865 0.0000129 -0.8884117 0.4906034 0.0000228 -0.0000016 -0.0000196 -0.1047525 0.9791829 -0.5630746 -0.0000245 -0.5950013 0.0861014 0.0000098 -0.0000453 -0.0001296 -0.1143362 0.9791084 0.5628361 -0.0000179 0.595123 0.0860382 -0.0000081 -0.0000131 0.0002079 -0.1143301 0.0721053 0.0561955 0.0000083 0.0244064 -0.0038443 -0.000015 0.000007 0.0000439 0.1583455 0.0721226 -0.0557717 0.0000031 -0.024333 -0.002676 0.0000124 -0.000001 0.0000057 0.1583459 0.0855511 -0.0040585 0.0000076 0.0214552 0.02267 -0.0000148 0.0000006 -0.0000099 0.1812962 0.085509 0.0041094 -0.0000044 -0.021575 0.0230347 -0.000002 0.000003 0.000031 0.1812977 unknown
polarizability: 399.309508|-0.0090404|195.621228|-0.0029601|-0.0047738|67.0776906 unknown
InChI: InChI=1S/C12H4Br4O/c13-7-1-5-6-2-8(14)10(16)4-12(6)17-11(5)3-9(7)15/h1-4H
charge 0 multiplicity 1
21 atoms
Br 4.429628 2.342048 -0.000003
Br -4.429713 2.342004 0.000013
Br 5.306866 -1.022913 -0.000051
Br -5.30691 -1.022967 0.000051
O  -0.000026 -1.903696 0.000015
C  0.729884 0.328912 -0.000003
C  -0.729947 0.328902 -0.000005
C  1.124199 -1.040827 -0.000009
C  -1.124242 -1.04084 0.000004
C  1.727914 1.324867 -0.000012
C  -1.727983 1.324851 -0.000005
C  2.456519 -1.4615 -0.000011
C  -2.456562 -1.461519 0.000022
C  3.083129 0.929373 -0.00002
C  -3.083196 0.92935 -0.000008
C  3.445092 -0.449552 -0.000025
C  -3.445142 -0.449577 0.000001
H  1.473598 2.387868 -0.000004
H  -1.473671 2.387853 0.000008
H  2.726116 -2.519608 0.000001
H  -2.726154 -2.519628 0.000042
