program: Gaussian 09
title: dpm-pentalene
version: ES64L-G09RevD.01
method: UPBE1PBE
basis: 6-311G(d)
operation: FOpt
keyword: #
keyword: upbe1pbe/6-311G(d)
keyword: opt
keyword: nosymm
keyword: scf=tight
keyword: guess=read
keyword: geom=allcheck
converged: YES YES YES YES
elementType: C
elementType: H
dipole: 0.0010 0.0001 -0.0002
dipole: 0.0011
quadrupole: -167.8167 -177.1380 -192.6571
quadrupole: 0.0023 -0.0137 0.0751
quadrupole: 11.3873 2.0659 -13.4532 0.0023 -0.0137 0.0751
hfenergy: -1308.6821525 hartree
pointgroup: C01 [X(C34H24)]
dipole: 0.0004075 0.0000383 -0.0000937 debye
InChI: InChI=1S/C34H24/c1-5-13-25(14-6-1)33(26-15-7-2-8-16-26)31-21-29-23-32(24-30(29)22-31)34(27-17-9-3-10-18-27)28-19-11-4-12-20-28/h1-24H
charge 0 multiplicity 3
58 atoms
C  5.96886662 -0.00051845 0.00126555
C  6.82271411 -1.17328262 0.0121259
C  6.82223438 1.17259203 -0.01046485
C  8.14194962 -0.73823439 -0.00363756
C  8.14164864 0.73808113 0.0039334
C  9.46132441 -1.17257375 -0.02383349
C  9.46086619 1.17297379 0.02275354
C  10.31473398 0.00038356 -0.00098799
H  6.46607466 -2.19294418 -0.03573783
H  6.46522399 2.19210809 0.03771636
H  9.81836117 -2.1925387 0.01346793
H  9.81742321 2.19309196 -0.01491273
C  11.70712923 0.00067794 -0.00172635
C  4.57639613 -0.00075324 0.00189422
C  12.47038676 1.21049834 0.34153983
C  12.09205919 2.03463421 1.41144827
C  13.6199938 1.5575321 -0.38410051
C  12.8234782 3.17026076 1.72985491
H  11.23034362 1.7593282 2.01086781
C  14.34326621 2.69837567 -0.07130199
H  13.93302679 0.92850921 -1.21148473
C  13.94838485 3.51067352 0.98695457
H  12.51857646 3.78729758 2.56982512
H  15.22055275 2.95617017 -0.65705798
H  14.51933692 4.39995882 1.23592566
C  12.4705648 -1.20879617 -0.34575939
C  12.09146763 -2.0331734 -1.41521452
C  13.62110149 -1.55527264 0.37867673
C  12.82306207 -3.16848465 -1.73433491
H  11.22898774 -1.75828844 -2.01372835
C  14.34455818 -2.69580189 0.06517028
H  13.93473119 -0.92606978 1.20569814
C  13.9489179 -3.50834234 -0.99261659
H  12.51754334 -3.78570639 -2.57394474
H  15.22258908 -2.95315729 0.6500033
H  14.52000806 -4.39738212 -1.24214633
C  3.81306183 1.21193958 -0.33069921
C  2.66310526 1.55281323 0.39732164
C  4.19218123 2.04542637 -1.39307621
C  1.94033751 2.69659351 0.09413565
H  2.34947765 0.9166097 1.21897686
C  3.46133595 3.18404699 -1.70184259
H  5.05416278 1.77524947 -1.99444434
C  2.33610344 3.51818309 -0.9565983
H  1.06278352 2.94943946 0.68164974
H  3.76695412 3.8084656 -2.53607402
H  1.7655684 4.40984746 -1.19789291
C  3.81368476 -1.21366509 0.33507273
C  2.66306584 -1.55462159 -0.39186642
C  4.1940529 -2.04731418 1.39687869
C  1.94083816 -2.69861563 -0.08821437
H  2.34848158 -0.91830962 -1.21307076
C  3.46375051 -3.18615638 1.7061181
H  5.05658431 -1.77709173 1.99743745
C  2.33783462 -3.5203592 0.96193327
H  1.06274582 -2.95151139 -0.67490194
H  3.77034028 -3.81070146 2.53989816
H  1.76773245 -4.41219857 1.20360373
