program: Gaussian 09
title: 000006972
version: EM64L-G09RevD.01
frameworkgroup: C1[X(C7H5BrO3)]
method: RPBEPBE
basis: SDD
operation: Freq
keyword: #p
keyword: freq=noraman
keyword: PBEPBE/SDD
title: #p freq=noraman PBEPBE/SDD
converged: NO YES NO NO
title: Mulliken charges:
elementType: Br O O O C C C C C C C H H H H H
charge: 0.018264 -0.395821 -0.419606 -0.324772 0.113712 0.154460 -0.244646 -0.319238 -0.225154 -0.141469 0.183284 0.289468 0.267666 0.257321 0.390709 0.395822
chargesum: 0.00000
title: Mulliken charges with hydrogens summed into heavy atoms:
elementType: Br O O O C C C C C C C
charge: 0.018264 -0.005113 -0.023784 -0.324772 0.113712 0.154460 0.044822 -0.051572 -0.225154 0.115852 0.183284
polarizability: 1.58357264e+02 2.37633921e-02 1.12312567e+02 5.00242700e-02 2.28596541e-02 3.72542657e+01
1716.lowfreq: -11.8712 -6.8245 -1.5628 -0.0006 -0.0003 -0.0002 81.5931 133.5456 136.7395
frequency: 81.5920 133.5447 136.7394 146.2038 265.1773 271.2988 312.1295 357.5683 420.6948 429.7359 509.7900 519.8150 585.5137 609.2254 620.7792 680.1424 742.8790 754.1251 823.5863 837.5842 841.5906 912.5913 966.7632 1026.8746 1066.0154 1117.4295 1158.2735 1224.8637 1257.0987 1302.3891 1388.5051 1400.4152 1411.7061 1461.3176 1564.8488 1572.4018 1642.4417 3058.2286 3164.2172 3183.8433 3186.5147 3533.5447
redmass: 9.1747 8.1757 10.3965 5.5836 12.5797 6.8505 6.9167 7.5136 3.1754 9.7584 4.6940 3.0813 1.2433 8.1659 5.2592 4.9070 5.7205 3.9398 1.4156 7.2830 1.1750 1.4366 1.3451 4.1654 2.2989 1.6924 1.5345 1.3662 3.4234 1.6055 5.8186 7.6343 1.9971 3.1556 4.2297 7.8321 5.0766 1.0682 1.0892 1.0938 1.0965 1.0642
irintensity: 0.4199 0.0343 0.4723 1.4099 0.4835 0.5962 0.0024 15.1768 11.9010 4.4335 16.6283 8.2630 158.2324 30.9141 43.3090 9.5239 21.7007 0.2633 182.2201 13.6190 33.2843 9.4822 0.8280 221.2722 22.7110 104.1117 107.8664 98.8054 102.7789 62.8822 53.2476 7.6664 232.3786 139.6878 43.6220 126.5430 148.3411 264.6806 0.7869 0.2193 4.2292 76.2261
temp: 298.150 k
press: 1.00000 atm
elementType: 35 8 8 8 6 6 6 6 6 6 6 1 1 1 1 1
symmnumber: 1
zpe: 279208.4 jmol-1
zpe.correction: 0.106345 hartree
zpe.thermalcorrener: 0.115881 hartree
zpe.thermalcorrenthalpy: 0.116826 hartree
zpe.thermalcorrgfe: 0.070185 hartree
zpe.sumelectzpe: -508.105688 hartree
zpe.sumelectthermal: -508.096152 hartree
zpe.sumelectthermalent: -508.095208 hartree
zpe.sumelectthermalfe: -508.141848 hartree
dipole: -0.2194 -1.1041 -0.0008
dipole: 1.1257
quadrupole: -76.9583 -63.5893 -74.7101
quadrupole: 10.4689 -0.0141 0.0141
quadrupole: -5.2057 8.1632 -2.9575 10.4689 -0.0141 0.0141
hfenergy: -508.2120332 hartree
pointgroup: C01 [X(C7H5Br1O3)]
dipole: 0.189366 0.4003139 -0.0054672 debye
dipolederiv: -0.5236055 0.2465068 0.0102774 0.318958 -0.2138132 -0.0065079 0.0097748 -0.0046634 -0.0284096 -1.0647315 0.5593514 0.0139843 0.3691797 -0.6911763 -0.0087936 0.0140234 -0.0116665 -0.3935377 -0.3287521 -0.1755864 -0.0031759 -0.4631083 -1.346299 0.0092132 -0.0043679 0.0013565 -0.4133244 -1.2568954 0.1020693 0.0229061 0.0846806 -0.6804522 -0.0031802 0.0222659 -0.0037189 -0.3571109 -0.8959863 -0.4442435 0.0207121 -0.1557348 -0.3669531 0.003746 0.0203751 0.0107612 -0.0474856 0.9675546 -0.6883348 -0.0182771 -0.2271454 0.5088371 0.0047559 -0.0183346 0.0156594 0.1179094 0.1426567 0.4028285 -0.0052819 0.0365001 -0.0883901 -0.0005254 -0.0055832 -0.009018 -0.026704 -0.329556 0.3166854 0.002864 -0.0021197 0.0773195 -0.0004819 0.0037141 -0.0086184 -0.1745229 0.7490495 -0.7467141 -0.0177359 -0.8024286 0.0199614 0.0170013 -0.0170814 0.0157107 -0.1663757 -0.1107684 0.0737088 0.0006864 0.1875614 0.244379 -0.0049695 0.0002971 -0.0022016 -0.052234 1.8218599 0.3672453 -0.0385458 0.5724433 1.6131717 -0.0098828 -0.0372783 -0.0052804 0.2650095 0.1329856 -0.0069301 0.0006871 0.015462 0.0329856 0.0001091 0.0009643 0.0006857 0.1615673 0.0703808 0.0230165 0.0024188 -0.0057635 -0.0319422 0.0007463 0.0026683 -0.0001143 0.1764448 -0.0118394 -0.0661906 0.0040384 -0.0532332 0.0886356 0.0014759 0.0038898 0.001712 0.1547449 0.4811063 0.0061764 -0.0022694 0.0112311 0.4372968 0.000244 -0.002642 -0.0004048 0.3766447 0.1565412 0.0304111 0.0067113 0.1135172 0.3964393 -0.0029503 0.0073146 -0.0001991 0.4073841 unknown
polarizability: 155.5788949|-10.8513817|115.0290718|-2.6960946|0.0593196|37.3161301 unknown
InChI: InChI=1S/C7H5BrO3/c8-4-1-2-6(9)5(3-4)7(10)11/h1-3,9-10H
charge 0 multiplicity 1
16 atoms
Br -3.574439 1.435005 0.032596
O  1.511463 -2.045928 -0.073499
O  1.84879 2.197748 -0.084184
O  2.916061 0.143129 -0.115662
C  0.495901 0.204691 -0.055214
C  0.403434 -1.229822 -0.049972
C  -0.689359 0.994029 -0.030194
C  -0.875105 -1.843605 -0.017032
C  -1.934329 0.358848 0.000234
C  -2.037859 -1.057076 0.007566
C  1.828779 0.811165 -0.08729
H  -0.600571 2.082887 -0.035476
H  -0.929757 -2.935271 -0.01245
H  -3.021032 -1.535704 0.031619
H  2.343646 -1.458844 -0.097329
H  2.791678 2.513749 -0.108612
