program: Gaussian 16
title: Title Card Required
version: ES64L-G16RevB.01
frameworkgroup: C1[X(C13H14ClNNaO6Rh)]
method: RwB97XD
basis: Gen
operation: Freq
keyword: #P
keyword: Geom=AllCheck
keyword: Guess=TCheck
keyword: SCRF=Check
keyword: GenChk
keyword: RwB97XD/ChkBas
keyword: Freq
converged: YES YES NO YES
title: Mulliken charges:
elementType: C C C H Rh C C C H C H C H H H Cl O C O O Na H O C O N C H H H C H H H O C H
charge: 0.544258 0.127065 -0.201923 0.219835 0.139087 -0.088807 -0.120760 -0.170810 0.224368 -0.122159 0.210609 -0.125690 0.199073 0.204765 0.194950 -0.424597 -0.562306 0.776522 -0.597268 -0.596097 0.565863 0.247547 -0.549303 0.760993 -0.481156 -0.475898 -0.227297 0.168958 0.151067 0.148932 -0.233771 0.147213 0.147564 0.179016 -0.420377 -0.144264 0.184799
chargesum: -0.00000
title: Mulliken charges with hydrogens summed into heavy atoms:
elementType: C C C Rh C C C C C Cl O C O O Na O C O N C C O C
charge: 0.544258 0.346900 0.045624 0.139087 0.135561 0.089849 0.028263 0.082605 0.069260 -0.424597 -0.562306 0.776522 -0.597268 -0.596097 0.565863 -0.549303 0.760993 -0.481156 -0.475898 0.241659 0.240022 -0.420377 0.040535
polarizability: 2.97574723e+02 -2.09320145e+01 2.33763196e+02 2.30444387e+00 -5.13882213e-01 1.88775280e+02
1716.lowfreq: -11.3197 -0.0017 -0.0015 0.0009 5.6748 9.6777 22.1551 27.4693 32.3242
frequency: 17.8078 27.2831 31.0434 49.1977 61.8600 71.0973 84.2681 86.3668 90.5587 96.8539 98.6538 99.7410 126.4257 134.7453 140.5191 150.2687 169.4739 182.2261 189.3559 193.3634 208.2942 229.5838 246.0815 274.5421 311.9949 356.1738 363.7570 373.8391 388.9921 400.4236 419.6046 452.7493 481.9129 585.4466 593.4435 620.2867 628.9255 686.6112 697.9833 721.9497 755.9746 785.4060 811.0439 828.1360 833.4468 840.1642 863.6873 880.6362 884.0046 885.3134 893.9192 895.0736 906.4912 965.3729 973.4676 987.5635 1022.1579 1041.9444 1044.4609 1055.6191 1070.3548 1083.8157 1087.6040 1105.7476 1122.8489 1142.4147 1149.2401 1182.9278 1193.8490 1213.0407 1270.3408 1294.2266 1303.7251 1336.0640 1404.5919 1411.6567 1422.6369 1435.0147 1460.8685 1464.9712 1471.3570 1494.9444 1495.3549 1504.4014 1513.8971 1518.4154 1538.8780 1562.8053 1647.0188 1716.8049 1882.8715 3057.4145 3062.3370 3128.3665 3139.0247 3214.5718 3216.4832 3287.6261 3294.8504 3297.9878 3304.4232 3314.0543 3319.9841 3323.8509 3330.6454
redmass: 5.5098 6.1258 4.4337 5.7659 3.8924 6.1669 4.1959 2.8759 3.6320 3.3363 8.8236 2.2469 3.4789 2.8729 8.0678 10.0036 7.1775 13.6476 9.7266 9.9773 12.3948 2.5015 22.0601 4.1142 18.8636 5.6927 7.1754 5.5742 4.9911 5.8502 5.6150 6.7273 3.5121 3.6444 3.5592 5.2891 4.7656 5.7729 14.6207 15.1804 10.7287 3.2603 1.4463 1.5614 3.8299 4.7301 1.2664 2.1874 2.8502 2.7826 1.4642 4.1974 1.2415 1.2708 1.2759 3.1292 1.5263 1.5793 1.4123 2.1153 11.2949 1.2793 1.1665 1.3406 2.5459 1.2294 4.1573 1.9065 1.5603 2.0455 1.7777 1.2794 6.2188 6.0129 8.3012 4.3528 5.3888 2.8394 1.6950 2.5073 1.4473 2.7120 1.2406 1.0524 1.0424 1.0518 3.3415 1.5876 12.8373 8.5049 11.3057 1.0397 1.0433 1.1033 1.1001 1.0997 1.0999 1.0916 1.0958 1.0946 1.1009 1.0950 1.1007 1.1037 1.1031
irintensity: 1.1138 0.2027 1.1455 3.0533 1.4474 9.2350 7.6322 3.3121 6.8649 5.1953 10.0493 4.9871 12.8880 2.4380 5.5349 10.6133 0.8759 14.2588 11.1572 3.4654 22.2153 5.9054 30.7033 0.9079 89.6062 7.4928 14.5836 17.3802 51.6159 2.1003 1.5352 0.4078 9.3882 5.8164 6.2730 7.9601 7.2635 2.9178 11.7126 10.0227 21.5880 60.2420 118.5439 17.6642 12.4959 8.8132 99.2714 51.2446 21.0258 23.9389 5.7237 4.4414 3.1654 2.9352 7.6927 19.4563 12.7109 42.9103 15.9732 52.6236 93.0455 1.2520 1.0657 10.6549 59.6655 2.6639 3.8291 599.3303 215.7541 7.1471 31.7624 0.0911 321.3993 16.8620 759.3845 0.3606 325.6160 197.0876 68.1876 39.1308 59.1575 21.8077 31.6695 13.4660 24.4885 11.8313 91.9612 131.1101 565.3755 181.4692 571.9481 39.9343 75.1287 37.3514 16.2844 1.0814 7.6331 0.4060 16.2884 1.5211 4.1466 4.1140 9.3238 7.6813 12.7326
temp: 298.150 k
press: 1.00000 atm
elementType: 6 6 6 1 45 6 6 6 1 6 1 6 1 1 1 17 8 6 8 8 11 1 8 6 8 7 6 1 1 1 6 1 1 1 8 6 1
symmnumber: 1
zpe: 700365.1 jmol-1
zpe.correction: 0.266755 hartree
zpe.thermalcorrener: 0.291468 hartree
zpe.thermalcorrenthalpy: 0.292412 hartree
zpe.thermalcorrgfe: 0.208645 hartree
zpe.sumelectzpe: -1742.494843 hartree
zpe.sumelectthermal: -1742.470129 hartree
zpe.sumelectthermalent: -1742.469185 hartree
zpe.sumelectthermalfe: -1742.552953 hartree
dipole: -6.1289 7.3986 3.1593
dipole: 10.1135
quadrupole: -105.4497 -152.0123 -158.0835
quadrupole: -9.5725 29.6398 -4.1670
quadrupole: 33.0654 -13.4971 -19.5683 -9.5725 29.6398 -4.1670
hfenergy: -1742.7615975 hartree
pointgroup: C01 [X(C13H14Cl1N1Na1O6Rh1)]
dipole: -2.4001639 3.1081876 0.6407629 debye
polarizability: 297.2990641|-20.3510158|232.0738834|6.9157414|-9.1829869|190.7402524 unknown
InChI: InChI=1S/C7H9NO3.C5H5.CO3.Cl.Na.Rh/c1-8(2)7(9)11-6-4-3-5-10-6;1-2-4-5-3-1;2-1(3)4;;;/h3-5H,1-2H3;1-5H;;;;/q;;-3;;+2;+1
charge 0 multiplicity 1
37 atoms
C  -2.27723753 -0.59327802 -0.05820396
C  -0.56191272 -0.93000977 1.23640024
C  -0.27377055 -1.54064177 0.03438681
H  -0.09906248 -0.9790377 2.20929037
Rh 1.24988262 0.39790413 0.07121048
C  1.70594346 2.02635165 -1.26360254
C  2.18708568 2.31460153 0.04556679
C  0.29294883 1.85697188 -1.18923778
H  2.33483955 1.82808335 -2.11894288
C  1.05040996 2.40725821 0.93304932
H  3.22663984 2.41459718 0.31879459
C  -0.10232079 2.11964063 0.17564894
H  -0.36781752 1.60021129 -2.00493705
H  1.08647258 2.60117396 1.99554888
H  -1.10959367 2.04656798 0.56282078
Cl 2.59151211 -0.54613569 1.90967923
O  2.10609281 -0.96333226 -1.18728932
C  3.44787889 -0.95595875 -1.16961862
O  4.06926543 0.14877434 -1.03484779
O  4.02131595 -2.07988705 -1.21097946
Na 5.08065178 -1.09607029 0.57051806
H  0.56496786 -2.18908377 -0.17370923
O  -3.4481538 -0.00115549 -0.35908169
C  -4.58868683 -0.6419152 0.11946813
O  -4.52749759 -1.69475976 0.71133307
N  -5.69369267 0.07478517 -0.16909066
C  -5.69597999 1.28026213 -0.97972735
H  -4.73977921 1.79442983 -0.91283428
H  -5.90650811 1.05167641 -2.03155604
H  -6.47643257 1.94946955 -0.60747468
C  -6.98982466 -0.50298589 0.13839159
H  -7.60556256 0.23134653 0.66676276
H  -7.50786984 -0.8007004 -0.78089803
H  -6.85368115 -1.37876729 0.77009169
O  -1.79365977 -0.35384345 1.18523997
C  -1.41470326 -1.3022499 -0.81372815
H  -1.55326004 -1.6215563 -1.8342872
