program: Gaussian 16
title: Title Card Required
version: ES64L-G16RevB.01
frameworkgroup: C1[X(C14H17ClNO5Rh)]
method: RwB97XD
basis: Gen
operation: Freq
keyword: #P
keyword: Geom=AllCheck
keyword: Guess=TCheck
keyword: SCRF=Check
keyword: GenChk
keyword: RwB97XD/ChkBas
keyword: Freq
converged: YES YES NO YES
title: Mulliken charges:
elementType: C C C H Rh C C C H C H C H H H Cl O C O O C O N C H H H C H H H O C H H C H H H
charge: 0.506790 -0.133730 -0.255493 0.395358 0.021298 -0.110680 -0.109416 -0.206763 0.190588 -0.160101 0.198245 -0.113725 0.184460 0.202075 0.191620 -0.393249 -0.425759 0.642913 -0.474379 -0.522377 0.810285 -0.520644 -0.464919 -0.227607 0.160749 0.152553 0.135984 -0.220949 0.183450 0.131902 0.148433 -0.416052 0.103287 0.164595 0.139013 -0.456892 0.204022 0.169635 0.175481
chargesum: -0.00000
title: Mulliken charges with hydrogens summed into heavy atoms:
elementType: C C C Rh C C C C C Cl O C O O C O N C C O C C
charge: 0.506790 -0.133730 -0.116480 0.021298 0.079908 0.088829 -0.022303 0.041974 0.077895 -0.393249 -0.425759 0.642913 -0.079020 -0.522377 0.810285 -0.520644 -0.464919 0.221678 0.242836 -0.416052 0.267882 0.092247
polarizability: 2.74325670e+02 -6.22752383e+00 2.39993276e+02 -2.93850620e+00 -2.48530187e+00 2.01517560e+02
1716.lowfreq: -10.2342 -7.2210 0.0008 0.0016 0.0019 7.9134 27.3481 44.8765 50.2551
frequency: 26.2906 44.8079 50.1084 63.5940 68.0234 86.8934 96.1870 98.9187 105.3002 112.7542 120.1453 129.3391 132.1045 144.7047 164.2522 175.2870 187.6326 201.3942 221.1721 244.2188 249.4158 257.4219 278.1125 299.7419 304.8338 354.2352 379.7662 395.2229 406.7106 485.8811 487.6488 514.7583 569.8827 584.7763 599.9590 623.5700 642.4010 646.3037 695.5558 733.5838 757.1543 763.1254 804.7978 828.5396 838.7086 849.3229 870.7505 877.0607 887.5293 903.4856 912.6498 932.3146 964.8109 968.6608 1017.3967 1029.5681 1045.5338 1053.4174 1066.8207 1074.5293 1085.5466 1089.1676 1106.0169 1129.4390 1142.0477 1147.3572 1180.4236 1188.9505 1218.1152 1241.3146 1276.8762 1294.1527 1300.4441 1336.0578 1390.2222 1411.1566 1417.7817 1425.6470 1461.2325 1465.7573 1468.5493 1474.1892 1480.5508 1496.7040 1501.9076 1511.7330 1512.8824 1514.1963 1521.4847 1560.1289 1591.1734 1654.3322 1768.2031 1843.1630 3052.7652 3059.6826 3093.3364 3122.3881 3129.1957 3181.9708 3203.0781 3214.3375 3241.6055 3270.1455 3279.2487 3288.2668 3295.0268 3303.4263 3310.6244 3317.6600 3574.4012
redmass: 6.2501 3.6649 4.5185 3.8293 5.3657 3.7885 2.2507 1.8438 2.9566 1.3798 4.3578 3.9666 6.8228 5.0237 1.4946 6.4175 7.1713 6.9137 5.7385 4.8516 4.1661 3.3617 5.6312 11.1156 9.9480 6.1763 4.3229 4.9232 5.9951 3.3097 3.7443 7.3529 2.0577 3.6547 4.0814 5.8101 4.4910 4.8638 5.9121 1.2787 6.4041 1.5499 8.1191 2.2110 5.3665 1.5678 1.2541 1.3680 5.6677 1.2121 6.6156 3.6669 1.2655 1.2013 1.5991 2.9009 1.4160 1.4860 1.8355 1.9126 1.3165 1.2596 1.3693 1.7723 1.2276 3.4188 3.8491 1.3831 2.1620 3.3948 2.4416 2.6455 1.2822 5.7035 1.2728 4.0128 3.9061 2.8633 1.1657 2.3951 1.5990 1.5798 1.0978 1.1649 1.0614 2.1726 1.2513 2.3547 1.0468 1.6651 4.4842 9.0836 8.7147 10.7329 1.0407 1.0411 1.0365 1.1042 1.1016 1.1005 1.1003 1.1066 1.0966 1.0926 1.0917 1.0930 1.0963 1.0981 1.1061 1.1038 1.0650
irintensity: 4.4194 0.2184 2.3244 1.5099 1.4340 4.6667 4.0503 1.7544 0.3342 0.1255 4.1484 2.9907 6.2126 0.5700 0.5931 3.1696 2.0599 3.9204 3.4341 5.4780 9.6748 5.5340 6.7259 26.3684 15.2509 10.0058 4.4293 14.9481 2.1993 9.2312 10.7464 6.0322 4.1259 2.7614 4.7681 11.3609 8.1455 41.8310 13.2078 99.5433 24.6104 74.5459 7.6615 42.7417 0.4115 57.9218 17.9169 8.4279 19.3904 10.5237 3.6876 3.2487 0.8075 3.1319 16.5179 34.9783 10.9876 16.6520 11.9248 21.9058 0.3784 10.3551 8.0164 48.3313 6.6767 3.2849 49.0272 16.4328 268.0166 218.9842 36.6203 307.3557 3.7655 36.7165 7.8208 6.5469 4.3402 152.9543 9.3190 16.9043 29.9752 139.6340 34.4826 65.4724 8.5402 63.3323 4.7448 58.0071 15.8486 257.1020 47.8834 70.6845 675.9822 643.6003 37.9924 81.2837 1.9256 60.3943 13.5247 2.8459 4.5160 2.7178 1.9820 6.6906 0.1762 0.0547 0.9727 1.4885 1.4589 1.2928 560.6920
temp: 298.150 k
press: 1.00000 atm
elementType: 6 6 6 1 45 6 6 6 1 6 1 6 1 1 1 17 8 6 8 8 6 8 7 6 1 1 1 6 1 1 1 8 6 1 1 6 1 1 1
symmnumber: 1
zpe: 792963.5 jmol-1
zpe.correction: 0.302024 hartree
zpe.thermalcorrener: 0.325565 hartree
zpe.thermalcorrenthalpy: 0.326509 hartree
zpe.thermalcorrgfe: 0.247836 hartree
zpe.sumelectzpe: -1544.821659 hartree
zpe.sumelectthermal: -1544.798118 hartree
zpe.sumelectthermalent: -1544.797174 hartree
zpe.sumelectthermalfe: -1544.875847 hartree
dipole: -4.0315 1.5315 2.5728
dipole: 5.0217
quadrupole: -121.8572 -146.8448 -135.7573
quadrupole: -8.4123 1.7437 -3.1487
quadrupole: 12.9625 -12.0250 -0.9375 -8.4123 1.7437 -3.1487
hfenergy: -1545.1236831 hartree
pointgroup: C01 [X(C14H17Cl1N1O5Rh1)]
dipole: -1.5861021 0.6025493 1.0122122 debye
polarizability: 274.3256658|-6.2275351|239.9932799|-2.938507|-2.4853009|201.5175595 unknown
InChI: InChI=1S/C7H8NO3.C5H5.C2H4O2.ClH.Rh/c1-8(2)7(9)11-6-4-3-5-10-6;1-2-4-5-3-1;1-2(3)4;;/h3,5H,1-2H3;1-5H;3H,1H3;1H;/q;;-1;;+2/p-1
charge 0 multiplicity 1
39 atoms
C  0.99955159 1.26600305 -1.24899539
C  -0.30592818 1.1360639 -0.87443307
C  -0.83741449 2.46840091 -1.11460536
H  -0.23709677 1.94871012 1.02256369
Rh -1.3525921 -0.40895158 -0.04778247
C  -3.31984367 -0.88590478 0.98376575
C  -3.1011573 -1.85675235 0.00363632
C  -3.32331868 0.42005307 0.35904791
H  -3.39369626 -1.06759075 2.04782253
C  -2.94526583 -1.17242426 -1.26373351
H  -2.97779136 -2.91774963 0.16548459
C  -3.16324683 0.21744089 -1.04373492
H  -3.51355669 1.36092152 0.85654354
H  -2.75377167 -1.64202668 -2.21805335
H  -3.13906328 0.98221228 -1.80670169
Cl 0.22991649 -2.09325903 -0.69848209
O  -0.220591 -0.25249878 1.79219076
C  0.19626943 0.74372065 2.38729862
O  0.02474432 1.97492211 1.96728711
O  2.03577183 0.40458299 -1.33241414
C  2.70025881 0.1216101 -0.16579682
O  2.52629377 0.75864428 0.85736548
N  3.58718383 -0.87877028 -0.3313075
C  4.33650231 -1.32513685 0.82575977
H  4.40918298 -0.5164683 1.55127605
H  3.84960873 -2.18745352 1.29821192
H  5.34296792 -1.61762799 0.5118818
C  3.65472931 -1.73052961 -1.50497919
H  2.96344502 -1.38391992 -2.26745876
H  4.67408679 -1.72545516 -1.907346
H  3.38520124 -2.75742781 -1.23565945
O  1.30470897 2.51001032 -1.68884988
C  0.16912284 3.23817413 -1.59785608
H  0.23422386 4.26645036 -1.91847666
H  -1.84960561 2.805284 -0.93625438
C  0.94330737 0.62785959 3.67285999
H  2.00674777 0.6737536 3.42002965
H  0.70845664 1.46128363 4.33690091
H  0.72880188 -0.32671323 4.15165432
