program: Gaussian 16
title: Title Card Required
version: ES64L-G16RevB.01
frameworkgroup: C1[X(C14H17ClNO5Rh)]
method: RwB97XD
basis: Gen
operation: Freq
keyword: #P
keyword: Geom=AllCheck
keyword: Guess=TCheck
keyword: SCRF=Check
keyword: GenChk
keyword: RwB97XD/ChkBas
keyword: Freq
converged: YES YES NO YES
title: Mulliken charges:
elementType: C C C H Rh C C C H C H C H H H Cl O C O H O C O N C H H H C H H H O C H C H H H
charge: 0.579348 -0.101313 -0.107209 0.394218 0.110668 -0.123517 -0.123398 -0.188469 0.199245 -0.145969 0.201944 -0.119661 0.186945 0.204593 0.191310 -0.356829 -0.501306 0.639352 -0.529011 0.174109 -0.509552 0.770509 -0.491852 -0.474459 -0.232415 0.151719 0.149343 0.184257 -0.233547 0.148054 0.176629 0.149835 -0.394901 -0.206896 0.182056 -0.457686 0.159108 0.185756 0.158995
chargesum: -0.00000
title: Mulliken charges with hydrogens summed into heavy atoms:
elementType: C C C Rh C C C C C Cl O C O O C O N C C O C C
charge: 0.579348 -0.101313 0.066900 0.110668 0.075727 0.078545 -0.001524 0.058624 0.071649 -0.356829 -0.501306 0.639352 -0.134793 -0.509552 0.770509 -0.491852 -0.474459 0.252905 0.240971 -0.394901 -0.024840 0.046172
chargesum: 0.00000
polarizability: 3.27161546e+02 -5.30857837e+00 2.36408344e+02 -5.02354951e+00 -8.67899881e+00 2.23680695e+02
1716.lowfreq: -1030.5919 -23.1822 -13.6441 -5.4167 -0.0020 -0.0018 -0.0003 20.9580 24.1851
frequency: -1030.5919 20.2397 22.5984 29.5684 35.1533 54.5630 58.8791 69.6420 75.7917 92.4028 98.6950 107.6107 120.8451 128.4925 138.2640 143.9394 159.4566 188.8261 203.2791 234.0713 250.7566 265.3464 291.0620 300.0636 329.8174 356.1973 371.8095 375.0145 394.4233 414.7453 432.5961 484.9971 551.3593 596.6408 602.5670 623.3983 653.4857 680.0671 712.2240 742.6719 750.1568 771.5662 821.7159 837.0234 841.7850 860.9438 862.8747 880.7422 901.6508 927.6049 934.7670 957.7762 965.5306 975.8253 976.0924 1014.2197 1025.9360 1043.5458 1051.7149 1067.1226 1075.4807 1085.0123 1086.6725 1094.1063 1105.3506 1139.9464 1147.8905 1177.3756 1188.6679 1205.1568 1267.9466 1298.9042 1325.9460 1342.0311 1371.9201 1398.4915 1412.8796 1418.0526 1452.7690 1465.1624 1471.6093 1475.1661 1479.9211 1493.7869 1496.2786 1498.8664 1503.8031 1514.3453 1518.3334 1533.9396 1551.1525 1567.9862 1623.3618 1728.4361 1871.4171 3061.1472 3065.4052 3086.1709 3130.5815 3139.1503 3172.2716 3203.5483 3216.4784 3225.8567 3276.3855 3285.1986 3286.7760 3299.7760 3303.1684 3311.2110 3346.7716
redmass: 1.1786 5.3816 4.5374 4.6810 4.0523 1.2541 2.8976 1.8887 2.2880 5.5295 3.5056 2.1520 6.2481 5.8119 3.0234 3.2986 5.9677 7.6335 7.6983 2.7103 6.2345 3.9816 5.4655 17.0490 5.4467 6.4991 5.2732 5.4260 3.3641 6.2197 7.0219 3.4105 4.2511 3.6094 3.9813 2.7705 5.8048 5.3583 5.8327 5.2681 10.8017 7.7835 1.3528 3.3173 5.2286 1.4002 5.9409 1.2109 1.2240 5.6318 1.3717 3.6489 1.2833 1.2248 3.3171 3.8170 1.5289 1.4223 1.4710 1.8139 1.8173 1.2182 1.2149 2.1492 1.3433 1.2264 4.3970 1.7049 1.4111 2.2067 1.5523 1.2770 5.8603 2.1517 4.4676 1.3066 4.2497 4.3468 2.1728 1.2358 2.4821 1.2086 1.3620 2.7435 1.2542 1.4340 1.0685 1.0442 1.0490 2.7051 2.0072 2.1310 7.0867 6.0911 11.1057 1.0391 1.0421 1.0376 1.1039 1.1020 1.0989 1.1068 1.0997 1.0994 1.0962 1.0920 1.0926 1.0974 1.0977 1.1064 1.1005
irintensity: 7498.7371 0.1928 6.0585 1.9199 3.1998 0.2803 3.7829 1.1325 6.2076 0.8793 0.2916 0.2838 1.7961 31.7214 8.9650 2.6943 5.4424 0.3378 12.2875 0.9530 22.7323 25.8972 4.8951 40.2519 7.8376 33.6740 15.5427 44.8265 18.5701 2.0896 3.4622 14.8073 17.0684 20.3050 12.1312 3.4088 21.0504 69.5638 1.7536 1.3285 24.4771 0.5170 79.7448 25.1535 23.0947 85.7557 43.3746 5.1092 11.2983 56.7932 23.2892 84.2571 5.7382 7.3288 57.1740 23.8881 13.8653 22.3070 10.0217 74.9835 11.6686 0.5562 5.6255 9.3305 8.3144 1.3388 6.4116 87.7175 96.0812 1069.9931 109.0225 0.0372 184.3378 56.8585 341.4464 19.4496 2.3026 3.0619 525.1605 92.7383 28.7440 89.1445 69.2167 35.8135 104.9048 52.1061 26.5921 24.4156 20.3459 275.8758 280.2914 45.7700 216.6620 798.2145 595.6457 34.3372 82.6402 3.7845 39.9936 15.1895 7.1835 8.4297 1.3001 2.9940 1.5750 0.6209 0.1211 1.9879 2.2585 1.5231 7.1856
temp: 298.150 k
press: 1.00000 atm
elementType: 6 6 6 1 45 6 6 6 1 6 1 6 1 1 1 17 8 6 8 1 8 6 8 7 6 1 1 1 6 1 1 1 8 6 1 6 1 1 1
symmnumber: 1
zpe: 775648.0 jmol-1
zpe.correction: 0.295429 hartree
zpe.thermalcorrener: 0.319059 hartree
zpe.thermalcorrenthalpy: 0.320003 hartree
zpe.thermalcorrgfe: 0.237983 hartree
zpe.sumelectzpe: -1544.812027 hartree
zpe.sumelectthermal: -1544.788397 hartree
zpe.sumelectthermalent: -1544.787452 hartree
zpe.sumelectthermalfe: -1544.869473 hartree
dipole: -3.5459 -4.4374 3.6449
dipole: 6.7491
quadrupole: -106.9117 -140.8929 -151.9839
quadrupole: -6.7007 23.2065 4.2471
quadrupole: 26.3511 -7.6300 -18.7211 -6.7007 23.2065 4.2471
hfenergy: -1545.1074553 hartree
pointgroup: C01 [X(C14H17Cl1N1O5Rh1)]
dipole: -0.8302982 2.3653601 -0.8753249 debye
polarizability: 323.1948739|-15.7468768|243.2218434|11.7470821|-5.6042332|220.8338676 unknown
InChI: InChI=1S/C9H12NO5.C5H5.ClH.Rh/c1-6(11)15-16-8-5-4-7(13-8)14-9(12)10(2)3;1-2-4-5-3-1;;/h4-5H,1-3H3;1-5H;1H;/q-1;;;+2/p-1
charge 0 multiplicity 1
39 atoms
C  -1.71056508 0.0173562 -0.58674221
C  0.3801202 -0.68779741 -0.58754494
C  0.095472 -0.09683723 -1.8183942
H  0.85020926 -1.90464244 -0.68066976
Rh 2.12403556 -0.17275058 0.50319712
C  3.82862461 1.24908824 0.42275869
C  3.32895934 1.21294255 1.74117544
C  2.77852204 1.66760436 -0.46137576
H  4.81569811 0.93126641 0.11481078
C  1.94409565 1.62086975 1.69460616
H  3.86590561 0.8941871 2.6229671
C  1.62422498 1.93178838 0.34688369
H  2.86250533 1.81338357 -1.52859487
H  1.27115795 1.67645682 2.53829525
H  0.65844039 2.25774164 -0.01495594
Cl 1.51948309 -1.67670228 2.26586926
O  3.20752031 -1.75027773 -0.35645404
C  2.68475377 -2.83487661 -0.75305315
O  1.44692494 -3.02458632 -0.90983456
H  0.80262305 -0.03568167 -2.63553859
O  -2.89304635 0.11181013 0.03637736
C  -3.93035543 0.83559278 -0.52288503
O  -3.80495371 1.50043128 -1.52871982
N  -5.0501832 0.68154888 0.21130058
C  -5.13000478 -0.07165099 1.45255595
H  -5.07986462 0.59797076 2.3191986
H  -6.08521457 -0.60350026 1.47829409
H  -4.32507646 -0.79922049 1.52020338
C  -6.22630257 1.45133086 -0.15062372
H  -6.45105928 2.19224771 0.62527409
H  -6.0488109 1.96374812 -1.09404728
H  -7.0873466 0.78422192 -0.2585093
O  -0.80926658 -0.5837614 0.1604658
C  -1.23343952 0.3574677 -1.83435224
H  -1.78398474 0.84207895 -2.62115152
C  3.62036162 -3.9800374 -1.03252498
H  4.60079666 -3.61284034 -1.33840394
H  3.73970527 -4.54715084 -0.10358061
H  3.20192996 -4.64354868 -1.79028345
