program: Gaussian 16
title: Title Card Required
version: ES64L-G16RevB.01
frameworkgroup: C1[X(C14H17ClNO5Rh)]
method: RwB97XD
basis: Gen
operation: Freq
keyword: #p
keyword: freq
keyword: wb97xd
keyword: chkbasis
keyword: scrf=(smd,solvent=1,4-dioxane)
keyword: guess=read
keyword: geom=(allcheck,modredundant)
title: #p freq wb97xd chkbasis scrf=(smd,solvent=1,4-dioxane) guess=read geom
converged: NO NO NO NO
title: Mulliken charges:
elementType: C C C H Rh C C C H C H C H H H Cl O C O O C O N C H H H C H H H O C H H C H H H
charge: 0.613027 -0.390702 -0.163950 0.426384 0.098340 -0.108683 -0.129457 -0.185551 0.199088 -0.125379 0.201408 -0.128867 0.191321 0.207303 0.192865 -0.394115 -0.478181 0.650487 -0.525184 -0.513371 0.799995 -0.485487 -0.458001 -0.227791 0.164253 0.159641 0.135937 -0.220252 0.173599 0.135036 0.154208 -0.416450 0.079569 0.171487 0.146426 -0.456885 0.188474 0.159403 0.160054
chargesum: -0.00000
title: Mulliken charges with hydrogens summed into heavy atoms:
elementType: C C C Rh C C C C C Cl O C O O C O N C C O C C
charge: 0.613027 -0.390702 -0.017524 0.098340 0.090405 0.071951 0.005770 0.081923 0.063998 -0.394115 -0.478181 0.650487 -0.098800 -0.513371 0.799995 -0.485487 -0.458001 0.232040 0.242591 -0.416450 0.251056 0.051046
chargesum: 0.00000
polarizability: 2.81001832e+02 -1.07776205e+00 2.37831960e+02 5.02093825e+00 -6.74653104e+00 2.20605278e+02
1716.lowfreq: -905.7441 -16.1948 -8.5163 0.0004 0.0010 0.0022 2.1669 29.5652 51.2088
frequency: -905.7430 29.0975 51.1088 56.6913 65.3316 70.0629 84.2716 88.1841 100.4909 117.1564 122.1108 123.7727 140.0625 147.0097 157.6982 180.7444 207.8243 213.1530 215.3895 252.8202 262.4002 272.3642 288.3153 297.9965 307.2479 356.2385 362.6683 376.4023 414.8746 424.5281 459.0975 495.9906 549.7916 592.4323 599.7146 613.5455 635.4124 657.8416 700.5758 732.2413 740.8861 778.3195 811.4665 836.5001 843.5836 861.2623 877.9237 878.3521 898.5943 904.6543 906.1326 958.7340 963.0822 970.0520 1022.5940 1030.0229 1046.6208 1053.7070 1071.3971 1073.3117 1086.6547 1088.3099 1092.3785 1094.7405 1119.3264 1140.9341 1150.0971 1182.6598 1192.1345 1202.3832 1244.4386 1297.4560 1301.3557 1328.7490 1384.6020 1402.0316 1413.0206 1421.7379 1436.4067 1455.9344 1471.1142 1474.3323 1476.6964 1484.0814 1490.6640 1493.0604 1498.7364 1511.4933 1521.8560 1545.3473 1565.0991 1609.5172 1641.6112 1730.6779 1873.3186 3057.7823 3066.3374 3090.4257 3132.6456 3138.1648 3178.4798 3204.4765 3204.7415 3225.1991 3282.6302 3285.0850 3292.8409 3300.9332 3304.9163 3313.6448 3328.0005
redmass: 1.2524 5.8481 3.4763 3.6157 3.7408 2.3165 1.4381 2.9356 5.6632 4.1842 4.6843 1.8869 3.5090 11.2906 4.3429 9.1253 1.8596 3.6366 3.9979 4.9641 3.4876 4.5213 5.7380 7.8873 8.4564 6.5070 6.3228 3.1695 5.3833 5.6853 4.2813 5.2881 4.1952 3.9266 3.5694 2.8179 5.1082 5.4708 5.2878 5.2833 1.9558 4.9996 5.5762 3.4931 4.2456 1.3909 1.3086 4.9663 1.2459 1.3185 6.1554 2.3798 1.5786 1.2693 2.9908 1.5357 1.4285 1.4947 1.8405 1.6850 1.6389 1.2754 1.2743 1.3528 2.5421 1.2309 4.5511 1.9910 1.4885 1.6872 2.9865 3.0293 1.3031 5.3816 1.5653 1.3626 3.9112 4.5374 2.9707 1.1751 1.8099 2.4593 1.0933 1.1759 1.2605 2.5972 1.0584 1.0826 1.0563 2.8513 1.7400 5.1684 4.4516 4.9767 10.8820 1.0406 1.0392 1.0361 1.1046 1.1012 1.1004 1.1065 1.1014 1.0988 1.0925 1.0923 1.0919 1.0977 1.0981 1.1063 1.1057
irintensity: 3334.8963 3.8726 0.2990 0.1314 4.1346 4.3573 0.6638 7.4685 4.1765 4.9079 2.0461 0.9835 2.4539 5.8181 7.0437 3.9997 1.7811 7.7036 2.8929 5.5449 34.1339 40.5531 32.5213 27.1221 22.1155 2.8026 20.3138 18.8425 7.5128 9.4971 24.4990 9.0666 14.5102 3.6008 23.5568 10.2317 2.6802 21.9031 58.8385 4.0819 57.1966 30.7402 19.2906 20.4976 10.0894 109.7366 9.4720 6.9337 10.0517 6.4058 10.3171 9.7243 16.5832 0.8326 7.6839 13.9820 19.9761 18.6434 72.4038 119.4926 58.0766 9.8535 53.9461 19.2747 1.6005 8.0870 6.4967 433.9782 35.2151 131.3557 171.3603 201.1158 6.7950 60.0346 173.7460 182.5203 17.6708 3.7904 427.0496 8.5781 53.4569 21.1270 52.0747 97.4614 42.9701 29.8593 5.8991 19.8355 16.9380 403.8836 135.3863 130.0989 37.5113 733.4581 671.5242 35.8534 61.4032 4.6002 60.9034 12.9568 5.3145 8.2391 3.1068 3.7737 4.4369 0.2268 0.0300 1.8478 2.3036 1.3177 0.3080
temp: 298.150 k
press: 1.00000 atm
elementType: 6 6 6 1 45 6 6 6 1 6 1 6 1 1 1 17 8 6 8 8 6 8 7 6 1 1 1 6 1 1 1 8 6 1 1 6 1 1 1
symmnumber: 1
zpe: 778644.0 jmol-1
zpe.correction: 0.296570 hartree
zpe.thermalcorrener: 0.319371 hartree
zpe.thermalcorrenthalpy: 0.320316 hartree
zpe.thermalcorrgfe: 0.243663 hartree
zpe.sumelectzpe: -1544.805702 hartree
zpe.sumelectthermal: -1544.782900 hartree
zpe.sumelectthermalent: -1544.781956 hartree
zpe.sumelectthermalfe: -1544.858609 hartree
dipole: 4.2069 -0.7979 0.0705
dipole: 4.2825
quadrupole: -119.2622 -134.2448 -150.6853
quadrupole: -4.7693 4.7366 2.8910
quadrupole: 15.4686 0.4860 -15.9546 -4.7693 4.7366 2.8910
hfenergy: -1545.1022718 hartree
pointgroup: C01 [X(C14H17Cl1N1O5Rh1)]
dipole: -1.6728781 0.1885465 -0.0686175 debye
polarizability: 281.3745308|2.1039956|236.1164071|-0.9860608|8.4314234|221.9481326 unknown
InChI: InChI=1S/C9H12NO5.C5H5.ClH.Rh/c1-6(11)15-16-7-4-5-13-8(7)14-9(12)10(2)3;1-2-4-5-3-1;;/h4-5H,1-3H3;1-5H;1H;/q-1;;;+2/p-1
charge 0 multiplicity 1
39 atoms
C  0.78573821 1.95902209 0.75307459
C  -0.41485956 1.27994919 0.88731764
C  -1.25183331 2.29010414 1.53752009
H  -0.39061246 0.23195929 1.68159743
Rh -1.27166232 -0.13073542 -0.50240622
C  -3.2079803 -1.17425395 -0.64400998
C  -2.74292273 -0.90166724 -1.95358443
C  -3.35917287 0.05973393 0.06357357
H  -3.34417353 -2.159244 -0.21773275
C  -2.61964269 0.52837804 -2.07438863
H  -2.49568166 -1.62883248 -2.7130305
C  -3.01712115 1.11767492 -0.84930245
H  -3.71214193 0.17118457 1.07888809
H  -2.25169407 1.05886454 -2.94106459
H  -3.01658801 2.17593068 -0.63091693
Cl 0.59808977 -0.12134155 -2.01502659
O  -0.35743331 -1.75532523 0.46638188
C  -0.13572052 -1.73488297 1.70842865
O  -0.3752888 -0.73433697 2.45117812
O  1.97248203 1.69398522 0.20548348
C  2.56790051 0.45855745 0.40429753
O  2.23909411 -0.27716261 1.30816244
N  3.59615922 0.27850247 -0.44649174
C  4.27047647 -1.00563408 -0.40779513
H  4.20655899 -1.4243283 0.59519847
H  3.81238499 -1.70630942 -1.11675941
H  5.32171935 -0.86546442 -0.67396079
C  3.83272582 1.08338707 -1.63174081
H  3.28171725 2.01812464 -1.57893025
H  4.90250539 1.30372136 -1.70708865
H  3.51434767 0.54145824 -2.52900424
O  0.74897172 3.20386706 1.23459639
C  -0.51930376 3.4021993 1.71845541
H  -0.70366052 4.3698463 2.15713347
H  -2.27369333 2.14978468 1.86099749
C  0.47272377 -2.95434837 2.33645287
H  1.55278858 -2.78597574 2.38039125
H  0.10431782 -3.08380891 3.35538306
H  0.27656208 -3.84351386 1.73704671
