program: Gaussian 16
title: Title Card Required
version: ES64L-G16RevB.01
frameworkgroup: C1[X(C12H18O2Rh)]
method: RwB97XD
basis: Gen
operation: Freq
keyword: #P
keyword: Geom=AllCheck
keyword: Guess=TCheck
keyword: SCRF=Check
keyword: GenChk
keyword: RwB97XD/ChkBas
keyword: Freq
converged: YES YES YES YES
title: Mulliken charges:
elementType: Rh C C C C C O C O C H H H C H H H C H H H C H H H C H H H C H H H
charge: 0.514240 0.045045 0.048227 0.048926 0.047197 -0.030806 -0.514755 0.656317 -0.514776 -0.423669 0.178279 0.193161 0.183088 -0.427179 0.176404 0.190350 0.185332 -0.428773 0.177450 0.192401 0.178610 -0.428361 0.175599 0.190397 0.181132 -0.426143 0.180102 0.191109 0.180789 -0.483340 0.198707 0.181431 0.183510
chargesum: 1.00000
title: Mulliken charges with hydrogens summed into heavy atoms:
elementType: Rh C C C C C O C O C C C C C C
charge: 0.514240 0.045045 0.048227 0.048926 0.047197 -0.030806 -0.514755 0.656317 -0.514776 0.130858 0.124907 0.119688 0.118767 0.125857 0.080308
polarizability: 2.45678688e+02 1.61266173e-01 1.98029467e+02 3.87390743e+00 4.17550903e-02 1.92279112e+02
1716.lowfreq: -34.1323 -16.5169 -0.0008 -0.0005 -0.0003 35.9831 55.0999 58.7977 71.1233
frequency: 53.3300 57.8513 70.8256 80.7487 90.3622 110.5556 113.8922 127.8032 147.4347 158.4525 160.3120 166.8546 177.5334 196.7561 240.8864 269.2964 308.6791 316.8352 327.3278 330.9298 370.5810 449.5551 475.2838 492.4369 499.8650 542.9115 543.6027 565.6103 605.6418 615.8563 627.8285 636.0417 703.8137 821.1072 824.4719 974.0576 980.8656 998.9820 1033.3689 1043.0787 1045.0308 1046.6655 1054.8203 1056.1748 1074.6652 1107.4934 1118.2266 1134.4157 1196.0259 1200.4679 1391.7762 1400.8349 1403.3574 1414.5228 1417.2623 1428.1292 1446.7073 1448.8631 1451.6200 1453.3221 1460.6325 1465.5362 1470.2197 1473.2906 1475.9937 1479.2468 1490.0715 1494.1159 1507.3951 1512.3039 1518.8717 1540.0911 1545.4761 1565.0807 1580.9800 3075.5463 3075.8959 3077.3498 3080.4313 3081.1005 3084.3651 3153.0181 3158.6157 3160.1024 3162.6414 3164.7805 3171.0728 3185.5609 3188.2628 3191.1080 3192.6573 3197.1793 3204.4373
redmass: 3.3499 2.6113 1.0204 1.2124 1.1138 1.3237 3.9084 1.0913 2.5320 3.1845 2.8816 2.9281 1.1635 3.6205 5.0689 4.6048 5.9478 2.4905 2.7352 2.7570 2.4984 4.0531 4.8303 4.1979 4.8031 4.2811 4.3994 2.5052 4.0095 2.6932 3.7616 3.7818 6.4138 2.4033 2.4136 6.5846 1.4814 1.4947 1.4799 1.4682 1.4747 1.4516 1.5551 1.5456 1.8712 1.8351 1.8049 1.7315 3.5935 3.3511 1.2834 1.4493 1.4639 1.2431 1.2028 1.1772 1.5937 1.1238 1.7127 1.4213 1.1479 1.0420 1.0989 1.3715 1.0920 1.3818 1.1914 1.5019 1.6510 1.5874 1.3761 5.2583 2.5952 2.9224 5.5385 1.0407 1.0390 1.0398 1.0410 1.0404 1.0386 1.1009 1.0978 1.0970 1.0973 1.0978 1.0984 1.1037 1.1048 1.1048 1.1039 1.1025 1.1068
irintensity: 1.4052 0.8533 1.0645 0.2030 0.9342 1.0487 0.9324 1.2694 1.1766 8.8958 14.0147 2.0131 1.1720 12.5202 4.2077 1.1731 71.3319 5.9162 7.6530 0.5087 0.0957 15.4224 33.1925 2.2850 20.2275 0.0513 0.0537 0.3003 11.0440 23.7708 0.7532 1.7666 214.8400 0.4351 0.2375 41.8436 0.4008 1.3465 7.0033 49.9908 53.8783 48.3056 3.8916 1.0902 19.1305 28.0084 25.9858 0.6449 1.3763 1.8997 7.7482 1.0599 0.1898 12.5508 10.8553 10.6815 0.1402 90.7420 1.5277 2.5071 7.8494 13.4078 66.9613 4.1684 1.1021 38.5993 9.1868 9.8031 19.1199 41.1866 109.7984 576.3070 78.5631 7.2613 345.5707 1.6457 1.0647 5.4249 4.9570 1.8650 0.1353 2.3164 6.0940 4.1769 4.3276 4.9229 2.2679 10.6274 3.9564 8.7453 4.3546 9.5434 2.9989
temp: 298.150 k
press: 1.00000 atm
elementType: 45 6 6 6 6 6 8 6 8 6 1 1 1 6 1 1 1 6 1 1 1 6 1 1 1 6 1 1 1 6 1 1 1
symmnumber: 1
zpe: 728438.7 jmol-1
zpe.correction: 0.277448 hartree
zpe.thermalcorrener: 0.295858 hartree
zpe.thermalcorrenthalpy: 0.296802 hartree
zpe.thermalcorrgfe: 0.231130 hartree
zpe.sumelectzpe: -728.639314 hartree
zpe.sumelectthermal: -728.620904 hartree
zpe.sumelectthermalent: -728.619960 hartree
zpe.sumelectthermalfe: -728.685632 hartree
dipole: -5.3306 0.0104 0.7268
dipole: 5.3799
quadrupole: -76.3953 -90.2610 -83.5761
quadrupole: 0.0711 2.2810 0.0303
quadrupole: 7.0155 -6.8502 -0.1653 0.0711 2.2810 0.0303
hfenergy: -728.9167619 hartree
pointgroup: C01 [X(C12H18O2Rh1)]
dipole: -2.1117058 -0.1253425 0.0715063 debye
polarizability: 243.6928002|6.4746812|198.2897807|8.5829004|-0.7080538|194.0046855 unknown
InChI: InChI=1S/C10H15.C2H3O2.Rh/c1-6-7(2)9(4)10(5)8(6)3;1-2(3)4;/h1-5H3;1H3;/q;-2;+2
charge 1 multiplicity 1
33 atoms
Rh 0.27857232 -0.14602847 -0.39083125
C  -1.67041653 -1.08125726 -0.37525963
C  -1.7844509 0.27231028 -0.89148886
C  -1.15599281 -1.01219802 0.94965971
C  -1.33829145 1.17317185 0.11606764
C  -0.90318625 0.38413117 1.25368873
O  2.20165389 -0.97121924 0.16257515
C  2.7816473 0.11464638 -0.16246169
O  2.05306711 1.07940733 -0.56248093
C  -0.39690148 0.91711576 2.54770633
H  0.04123573 1.9086299 2.42390345
H  -1.23472962 0.99570658 3.24981141
H  0.35166267 0.25291058 2.9840023
C  -1.29073532 2.65962499 0.03657325
H  -1.29548854 3.00701976 -0.99733083
H  -2.17157974 3.06955722 0.54239042
H  -0.40174621 3.05324718 0.53356586
C  -2.29667416 0.62574757 -2.24516684
H  -2.02227122 -0.13221294 -2.98189902
H  -3.39055327 0.67753017 -2.20924353
H  -1.9199575 1.59368209 -2.57932003
C  -2.04600241 -2.31136118 -1.12800784
H  -1.64535952 -3.20968771 -0.6566704
H  -3.13778757 -2.39419825 -1.15824217
H  -1.68770475 -2.26588728 -2.15960641
C  -0.88955564 -2.15816499 1.8628497
H  -0.09105878 -1.92487623 2.56901531
H  -1.79872349 -2.37421223 2.43440032
H  -0.61353035 -3.05560155 1.30682678
C  4.26715159 0.24502369 -0.10564504
H  4.67376121 -0.00378677 -1.09156701
H  4.6842719 -0.44608711 0.6277361
H  4.54786778 1.27251774 0.13107302
