program: Gaussian 16
title: Title Card Required
version: ES64L-G16RevB.01
frameworkgroup: C1[X(C7H9NO3)]
method: RwB97XD
basis: 6-31G(d,p)
operation: Freq
keyword: #P
keyword: Geom=AllCheck
keyword: Guess=TCheck
keyword: SCRF=Check
keyword: GenChk
keyword: RwB97XD/6-31G(d,p)
keyword: Freq
converged: YES YES YES YES
title: Mulliken charges:
elementType: C C C C O H H H O C O N C H H H C H H H
charge: 0.542454 -0.183747 -0.199272 0.093737 -0.427917 0.151652 0.154183 0.165447 -0.559597 0.812877 -0.522568 -0.500237 -0.227306 0.146245 0.174803 0.145585 -0.232912 0.143618 0.145194 0.177759
chargesum: -0.00000
title: Mulliken charges with hydrogens summed into heavy atoms:
elementType: C C C C O O C O N C C
charge: 0.542454 -0.029564 -0.047620 0.259184 -0.427917 -0.559597 0.812877 -0.522568 -0.500237 0.239327 0.233660
polarizability: 1.28021996e+02 -8.59190949e+00 6.91637331e+01 2.31295515e+00 4.34040037e+00 8.17751318e+01
1716.lowfreq: -11.3708 0.0002 0.0007 0.0009 10.5926 23.8068 41.7048 55.3908 65.1286
frequency: 41.5538 54.5278 65.0641 88.8704 99.9322 133.2474 231.6441 259.8691 330.9391 382.7279 450.4702 478.5184 619.6160 625.3598 680.7282 753.0014 756.3742 789.0441 818.8232 880.9634 895.0832 905.9071 993.5860 1039.4220 1056.3105 1097.8825 1133.6953 1142.3314 1188.0006 1198.4269 1217.8340 1280.3660 1315.7658 1338.4382 1448.6097 1454.8221 1470.0260 1490.9627 1503.0896 1513.1817 1517.8972 1560.4206 1595.4342 1708.4637 1872.9209 3052.0117 3056.6518 3121.3540 3125.8089 3210.5571 3217.3841 3290.5241 3309.4551 3324.9248
redmass: 3.2760 3.1400 1.4424 1.5122 3.7665 2.7072 2.3148 3.9821 5.1904 3.4910 6.8386 3.5227 4.9731 3.6563 4.5332 1.5029 6.4324 5.2214 1.5011 4.1128 1.4462 5.9286 3.0916 1.3669 2.1641 1.3604 2.6555 1.2265 1.5437 2.0774 2.0389 1.8184 7.3340 6.6720 2.1260 1.3368 2.2563 1.2268 1.0492 1.0449 1.0519 1.5072 4.8021 7.7684 11.2790 1.0408 1.0410 1.1028 1.1026 1.0995 1.0988 1.0918 1.1003 1.1070
irintensity: 4.6896 0.0682 0.0770 1.0049 4.3802 0.3989 6.0960 0.6190 2.3185 19.5104 0.6068 9.6016 7.5345 7.7306 6.5463 53.9118 28.2908 8.4937 15.8751 32.0708 4.1706 3.4884 21.8662 38.4427 19.2783 4.6402 34.1882 1.3150 180.3436 394.7328 46.7178 11.1845 249.0427 37.1879 220.3628 62.4343 37.9720 49.0816 11.1247 22.0842 15.3081 201.4544 21.8939 120.4275 597.2223 32.3418 92.5071 60.5588 3.7146 1.2059 4.2587 3.3115 1.4191 0.0292
temp: 298.150 k
press: 1.00000 atm
elementType: 6 6 6 6 8 1 1 1 8 6 8 7 6 1 1 1 6 1 1 1
symmnumber: 1
zpe: 419822.4 jmol-1
zpe.correction: 0.159902 hartree
zpe.thermalcorrener: 0.170797 hartree
zpe.thermalcorrenthalpy: 0.171742 hartree
zpe.thermalcorrgfe: 0.121478 hartree
zpe.sumelectzpe: -552.250334 hartree
zpe.sumelectthermal: -552.239438 hartree
zpe.sumelectthermalent: -552.238494 hartree
zpe.sumelectthermalfe: -552.288758 hartree
dipole: -1.9075 2.1936 0.2628
dipole: 2.9188
quadrupole: -43.7396 -66.9766 -60.0835
quadrupole: -2.9578 0.3082 1.5258
quadrupole: 13.1936 -10.0433 -3.1503 -2.9578 0.3082 1.5258
hfenergy: -552.4102358 hartree
pointgroup: C01 [X(C7H9N1O3)]
dipole: 0.7852475 0.6053115 -0.5793899 debye
dipolederiv: 1.3028083 0.5259701 0.3304136 0.5323525 1.0818555 0.4782601 0.1015421 0.3308778 0.2946507 -0.1079777 -0.0576432 -0.0696001 -0.1678103 -0.2430338 -0.0239854 -0.0877936 -0.041299 -0.2173156 0.0601958 0.0910473 -0.0106159 0.0822461 -0.0458946 0.0367909 -0.0063986 0.0377305 -0.1793352 0.0491214 0.022488 -0.038693 0.0842008 0.3922452 0.1692911 0.0115663 0.1904498 -0.020392 -0.5788408 -0.0641868 -0.0127206 0.0554796 -0.8322485 -0.2984208 0.0756644 -0.2558263 -0.2335353 0.0610892 -0.0792112 -0.0246148 -0.0713088 0.0321085 -0.0457155 -0.0141884 -0.0428592 0.1498938 0.0218992 0.0511263 0.0420136 0.0389817 0.1190458 -0.024968 0.0386499 -0.0209947 0.169377 0.0210315 0.0021465 0.0175706 0.0270109 0.087924 -0.0461743 0.0292584 -0.0400908 0.167807 -1.4053746 -0.7748042 -0.6293752 -0.7844608 -0.8736828 -0.3399755 -0.812707 -0.4828264 -1.038839 1.9274774 1.3002858 0.3294083 1.2060922 1.563209 -0.2014069 0.7257941 0.1823472 1.7683653 -0.8092047 -0.4074421 0.0654297 -0.4040687 -0.8639516 0.3128064 0.0533506 0.2721659 -1.0552524 -1.1170557 -0.596555 -0.0655483 -0.7199673 -1.0219133 0.0650742 -0.1889801 -0.1058222 -0.6408202 0.2971446 0.0282902 -0.2190442 0.100354 0.4238259 -0.1574176 -0.3205248 -0.2087249 0.3544071 -0.1319716 0.0044139 0.1292634 0.0805273 -0.0130551 -0.0115524 0.0975674 0.0616415 -0.0004231 0.0284195 0.0240452 -0.0737621 0.0168415 0.1298512 0.0049249 -0.0411082 0.0193494 -0.009259 0.0454895 -0.05638 0.0380667 -0.0787604 -0.145082 -0.0094642 0.0163249 -0.0839452 0.0332956 0.4135523 -0.0140436 0.2210404 -0.0302857 0.2332192 0.1473815 0.3690166 0.2844166 0.3723228 -0.1933353 0.0098381 -0.0507671 0.0661579 0.0476044 -0.0386958 0.0164355 -0.0793877 0.0201263 0.0191443 0.0077671 -0.0491897 -0.0387413 -0.156162 -0.1038329 -0.0662192 -0.0473514 0.0390074 0.0963875 -0.0171523 0.0707247 0.005159 0.0841351 0.08708 0.00275 0.030149 0.0259187 unknown
polarizability: 110.7537509|22.5431334|95.933896|5.0051199|12.1826454|72.2732137 unknown
InChI: InChI=1S/C7H9NO3/c1-8(2)7(9)11-6-4-3-5-10-6/h3-5H,1-2H3
charge 0 multiplicity 1
20 atoms
C  0.23592371 0.92760145 -0.08265846
C  0.14758612 -0.33265016 -0.56599961
C  -1.24927365 -0.65237867 -0.51525068
C  -1.8725071 0.43987754 -0.01084166
O  -0.9698093 1.42273684 0.25352306
H  -1.71946454 -1.57749034 -0.81389106
H  0.96648872 -0.94920763 -0.9020338
H  -2.90145811 0.67357564 0.21115932
O  1.28181005 1.77527965 0.03284521
C  1.84851132 1.87706885 1.29281074
O  1.48288689 1.19757736 2.22550424
N  2.82177878 2.81383091 1.3041717
C  3.2672909 3.54873828 0.13452369
H  4.19126151 3.11966754 -0.2721707
H  2.5033902 3.54240265 -0.63902064
H  3.46510182 4.58585777 0.42166997
C  3.6059198 2.9864614 2.51157759
H  4.64181299 2.66701608 2.34658718
H  3.60843002 4.04043342 2.80816434
H  3.17181196 2.39003336 3.31159917
