program: Gaussian 16
title: Title Card Required
version: ES64L-G16RevB.01
frameworkgroup: OH[O(Cl)]
method: RwB97XD
basis: 6-31G(d,p)
operation: Freq
keyword: #P
keyword: Geom=AllCheck
keyword: Guess=TCheck
keyword: SCRF=Check
keyword: GenChk
keyword: RwB97XD/6-31G(d,p)
keyword: Freq
converged: YES YES YES YES
title: Mulliken charges:
elementType: Cl
charge: -1.000000
chargesum: -1.00000
title: Mulliken charges with hydrogens summed into heavy atoms:
polarizability: 6.64935513e+00 2.38597858e-17 6.64935513e+00 -1.11874615e-18 2.68362158e-17 6.64935513e+00
1716.lowfreq: 0.0094 0.0094 0.0094
temp: 298.150 k
press: 1.00000 atm
elementType: 17
zpe: 0.0 jmol-1
zpe.correction: 0.000000 hartree
zpe.thermalcorrener: 0.001416 hartree
zpe.thermalcorrenthalpy: 0.002360 hartree
zpe.thermalcorrgfe: -0.015023 hartree
zpe.sumelectzpe: -460.297441 hartree
zpe.sumelectthermal: -460.296024 hartree
zpe.sumelectthermalent: -460.295080 hartree
zpe.sumelectthermalfe: -460.312464 hartree
dipole: 0.0000 0.0000 0.0000
dipole: 0.0000
quadrupole: -15.6402 -15.6402 -15.6402
quadrupole: 0.0000 0.0000 0.0000
quadrupole: -0.0000 -0.0000 -0.0000 0.0000 0.0000 0.0000
hfenergy: -460.2974408 hartree
pointgroup: OH [O(Cl1)]
dipole: 0. 0. 0. debye
dipolederiv: -1. 0. 0. 0. -1. 0. 0. 0. -1. unknown
polarizability: 6.6493551|0.|6.6493551|0.|0.|6.6493551 unknown
InChI: InChI=1S/Cl
charge -1 multiplicity 1
1 atoms
Cl 0.0000 0.0000 0.0000
