program: Gaussian 09
title: 000049939
version: EM64L-G09RevD.01
frameworkgroup: C1[X(C8H18O3S)]
method: RPBEPBE
basis: SDD
operation: Freq
keyword: #p
keyword: freq=noraman
keyword: PBEPBE/SDD
title: #p freq=noraman PBEPBE/SDD
converged: YES YES NO NO
title: Mulliken charges:
elementType: S O O O C C C C C C C C H H H H H H H H H H H H H H H H H H
charge: 1.033345 -0.575240 -0.518274 -0.517573 -0.379253 -0.374545 -0.372172 -0.327881 -0.353321 -0.607392 -0.356227 -0.694570 0.201054 0.201112 0.204340 0.205607 0.192498 0.192003 0.235540 0.238072 0.190368 0.190474 0.291172 0.291864 0.195635 0.195434 0.210584 0.217010 0.210551 0.379787
chargesum: 0.00000
title: Mulliken charges with hydrogens summed into heavy atoms:
elementType: S O O O C C C C C C C C
charge: 1.033345 -0.195453 -0.518274 -0.517573 0.022913 0.035402 0.012328 0.145730 0.027521 -0.024357 0.034842 -0.056425
polarizability: 1.68322036e+02 1.59503165e+00 1.08940845e+02 1.37350486e-01 -5.49830466e-02 1.04696797e+02
1716.lowfreq: -0.0006 0.0012 0.0014 2.2211 6.1241 11.2826 21.9856 42.1765 45.4194
frequency: 20.1248 42.0090 43.7003 53.5493 88.5449 101.8697 105.3012 139.8137 150.4763 157.3176 175.3459 183.8713 228.3816 237.4879 281.5355 294.4260 299.5947 339.0183 387.6995 435.3584 470.3300 554.6717 601.8618 725.1326 734.3137 758.6674 790.5562 843.9870 852.2387 888.8280 921.2829 957.5728 987.3064 1010.8451 1012.9531 1027.0455 1043.8086 1070.0394 1073.6902 1080.0809 1096.4792 1120.1147 1185.8515 1218.2702 1219.7497 1250.0885 1257.4125 1284.5327 1284.9099 1286.7229 1298.5700 1303.8838 1321.1470 1344.4792 1353.7355 1356.5984 1391.2957 1414.2147 1463.6847 1464.3561 1468.9830 1473.7854 1477.4817 1480.4882 1487.0815 1490.6306 2953.9123 2957.2621 2963.2771 2968.6084 2973.0062 2973.7054 2989.8847 2997.3284 3000.9480 3012.5503 3028.7820 3043.2029 3055.5894 3064.1813 3070.2383 3072.8199 3147.3669 3501.9303
redmass: 5.5575 3.6017 2.7800 2.3306 1.8386 4.7471 2.3148 1.8752 2.1111 5.4343 1.6616 4.3566 1.1321 2.0339 4.0434 4.6030 4.8346 7.5436 4.9623 3.5680 3.3166 12.7423 5.3474 1.0627 1.0841 1.1063 1.1880 11.7635 1.2722 1.8974 1.6045 2.2957 4.5692 1.2844 3.2167 1.6095 2.2992 2.4168 2.5748 2.2338 1.2753 2.6447 1.7815 1.2798 1.4057 1.2461 1.2848 1.0623 1.2422 1.1616 1.0784 1.1091 1.3352 1.4052 1.5274 1.6419 1.2169 1.1051 1.0703 1.0730 1.0688 1.0751 1.0421 1.0787 1.0899 1.0976 1.0589 1.0589 1.0590 1.0592 1.0587 1.0364 1.0973 1.0588 1.0996 1.1023 1.1044 1.1048 1.0560 1.1049 1.1007 1.0993 1.1107 1.0665
irintensity: 0.7615 0.8532 0.3457 0.6400 0.0418 2.4803 0.5300 0.0437 1.1719 4.2330 39.8499 2.2988 0.2439 41.9465 10.1960 18.6419 60.8047 15.4775 18.3794 11.4263 9.8315 145.1669 5.7825 13.7877 0.4981 5.6965 0.1971 46.3403 0.2920 5.3772 29.2080 51.1391 1.9370 10.8493 5.4589 39.6457 17.9857 11.7918 3.7853 2.1479 16.8537 20.9619 0.9203 10.2781 2.6594 5.0246 0.2138 1.5697 6.6120 0.1817 0.0167 0.0187 6.5932 9.4705 0.1829 0.2851 11.3930 6.3863 0.1094 0.1563 2.2814 0.2968 12.6852 2.4862 0.4829 34.1718 0.1429 4.1959 0.1507 17.8794 135.5613 44.6211 0.1518 18.7369 0.1543 1.0036 3.0033 92.6299 4.8591 40.9181 100.6039 53.0508 1.1210 48.8387
temp: 298.150 k
press: 1.00000 atm
elementType: 16 8 8 8 6 6 6 6 6 6 6 6 1 1 1 1 1 1 1 1 1 1 1 1 1 1 1 1 1 1
symmnumber: 1
zpe: 662371.0 jmol-1
zpe.correction: 0.252284 hartree
zpe.thermalcorrener: 0.268944 hartree
zpe.thermalcorrenthalpy: 0.269888 hartree
zpe.thermalcorrgfe: 0.205697 hartree
zpe.sumelectzpe: -938.201950 hartree
zpe.sumelectthermal: -938.185290 hartree
zpe.sumelectthermalent: -938.184346 hartree
zpe.sumelectthermalfe: -938.248537 hartree
dipole: -3.2335 2.5969 -0.0676
dipole: 4.1477
quadrupole: -87.6520 -88.5331 -88.7226
quadrupole: 8.9553 -0.7574 -0.0896
quadrupole: 0.6506 -0.2305 -0.4200 8.9553 -0.7574 -0.0896
hfenergy: -938.4542336 hartree
pointgroup: C01 [X(C8H18O3S1)]
dipole: -1.2822051 1.0077197 -0.0580159 debye
polarizability: 168.2720364|2.1130867|108.9556904|-1.0573405|-0.3148809|104.7319503 unknown
InChI: InChI=1S/C8H18O3S/c1-2-3-4-5-6-7-8-12(9,10)11/h9H,2-8H2,1H3
charge 0 multiplicity 1
30 atoms
S  3.925012 -0.200122 -0.100359
O  4.985909 1.319152 -0.338165
O  4.035034 -1.155901 -1.401727
O  4.193264 -0.829114 1.366793
C  -1.475823 -0.249736 -0.008226
C  -0.237178 0.674077 -0.064827
C  -2.809147 0.531483 -0.014215
C  1.088173 -0.13234 -0.049324
C  -4.050654 -0.38784 0.030671
C  2.285889 0.811921 -0.129647
C  -5.386099 0.391011 0.027244
C  -6.621403 -0.534257 0.068173
H  -1.42321 -0.879732 0.903465
H  -1.453795 -0.945907 -0.871687
H  -0.284992 1.29647 -0.981652
H  -0.259174 1.372537 0.796257
H  -2.834448 1.223262 0.853548
H  -2.85846 1.16826 -0.922229
H  1.141314 -0.73518 0.877537
H  1.103431 -0.834261 -0.904747
H  -4.028846 -1.078532 -0.838056
H  -4.003443 -1.027099 0.937018
H  2.400962 1.480828 0.737689
H  2.363168 1.368714 -1.076719
H  -5.408476 1.079401 0.896714
H  -5.431647 1.031419 -0.877341
H  -6.615629 -1.163229 0.978411
H  -7.562649 0.045463 0.064259
H  -6.637902 -1.211723 -0.806381
H  5.943518 1.031975 -0.330778
