program: AMS
title: Zn complexes
programVersion: 2023.104
runtype: GEOMETRY OPTIMIZATION
runtype: FREQUENCIES
method: DFT
functional: Becke88 Perdew86
functional: VWN
spinMolecule: Restricted
formula: C14H17BrN6O3Zn
InChI: InChI=1S/C12H17BrN4O.2CNO.Zn/c1-9(10-6-5-7-11(13)14-10)15-16-12(18)8-17(2,3)4;2*2-1-3;/h5-7H,8H2,1-4H3;;;/q-1;;;+1
42 atoms
Zn 3.401817 4.950755 10.029122
Br 5.121728 7.524114 8.050508
N  4.043699 4.990201 7.738780
N  2.914346 3.051664 9.154054
N  2.364662 2.088346 9.957710
N  1.204782 0.176439 11.794136
O  2.453380 3.685868 11.692416
C  4.502812 6.016328 7.050445
C  4.566995 6.066717 5.651544
H  4.949220 6.951818 5.147704
C  4.120665 4.947754 4.958353
H  4.145872 4.935712 3.867962
C  3.630390 3.847432 5.665130
H  3.265903 2.970612 5.133583
C  3.593930 3.902560 7.064259
C  3.032353 2.812225 7.879078
C  2.592598 1.537606 7.219319
H  2.337173 0.793925 7.979300
H  3.385236 1.135434 6.573223
H  1.707190 1.711027 6.587931
C  2.206767 2.558033 11.208818
C  1.623348 1.583068 12.242753
H  2.363725 1.445864 13.041574
H  0.729014 2.046420 12.678893
C  2.395861 -0.582086 11.257108
H  3.145885 -0.651959 12.051985
H  2.782521 -0.006307 10.409215
H  2.061487 -1.582504 10.960536
C  0.132589 0.264069 10.733042
H  0.562106 0.816585 9.890456
H  -0.723074 0.803571 11.152767
H  -0.159156 -0.754292 10.453324
C  0.655515 -0.552275 12.988670
H  0.354220 -1.559894 12.680608
H  -0.209852 -0.002366 13.372660
H  1.433483 -0.611802 13.756965
N  1.908001 6.101284 9.662260
C  1.461672 6.525946 8.624277
O  0.980294 6.967140 7.610747
N  5.106979 5.059401 10.844555
C  6.019756 5.813824 11.066980
O  6.966149 6.513464 11.319032
zeropoint: 8.243124 electronvolt
frequency: 18.36281798 24.89830517 31.19983334 38.56463029 40.68823854 49.04120806 51.48539902 55.60579080 75.75444888 85.82978505 97.34772073 104.38251759 109.56942746 117.45693015 120.78254064 137.04005645 144.87276814 158.28555259 160.43005467 182.90094414 196.35446329 215.55345532 241.07399978 246.70685462 283.75597018 294.57659954 296.30611442 308.30721419 332.15169883 348.95045926 351.18990772 356.50001276 369.28290735 398.56710329 422.58159960 426.55618644 434.52770225 442.55375493 492.35719523 506.59330960 518.28288106 593.76365122 595.93780910 607.00984100 617.04610132 621.11847193 630.90499110 638.09853744 688.86992822 702.60101135 718.60984945 743.89442081 775.03228498 801.64650545 858.21509857 869.11320997 891.82635589 941.73162718 950.54836494 963.94755015 964.12312182 977.58809294 1001.76726563 1010.73827442 1038.18145615 1065.09369796 1081.35039559 1098.51998946 1100.66290540 1110.99614332 1143.16150155 1167.44169527 1183.91837625 1217.52126605 1249.41227899 1278.37137627 1291.91960290 1294.91619102 1305.72454815 1318.37858305 1319.61315300 1328.05703525 1341.12209998 1363.54963204 1386.31399096 1398.00746336 1405.50046806 1418.22528433 1421.49293553 1423.33190563 1431.41160930 1444.03499187 1447.45267559 1453.13289963 1458.75172166 1469.56118824 1488.28843970 1533.70430293 1559.60988188 1581.12847040 1597.15877793 2196.29984449 2226.53346118 2956.64724518 2970.08962761 2975.39477825 2986.93649577 2996.54780678 3013.18143658 3051.19262157 3071.37112970 3075.83798624 3076.28096006 3078.21088226 3079.71414270 3083.25266848 3086.95330009 3105.38923071 3131.71512068 3142.57023992 cm-1
elementType: Zn Br N N N N O C C H C H C H C C C H H H C C H H C H H H C H H H C H H H N C O N C O
absortion: 2.10388344 0.84636202 3.09012256 3.27768278 1.92965273 1.22269164 2.21552500 0.79345541 0.67272167 5.21835084 0.64964729 0.83746055 2.94265669 1.43964192 6.37257714 13.04920609 14.47647096 3.37531974 20.71928311 14.96529944 1.32650902 2.73285867 1.38539423 6.67374954 1.97619706 0.21481844 0.58197755 3.19643834 3.05712162 1.86015086 0.88835922 32.25546214 11.82385003 6.99475413 4.89899848 0.40393799 55.55625532 8.31718165 0.18864672 0.73020096 4.46941081 11.34753158 5.68470788 0.60261240 0.81637038 16.83517895 9.89125873 18.44646875 33.84821795 51.98972390 11.69911198 1.97431895 28.18784711 24.46859398 117.15244847 0.09736020 14.72406301 35.01509959 0.78716833 0.12885969 0.89879246 1.84336368 16.14106498 2.46902597 0.38861245 94.64684656 0.47029222 14.17810618 0.76830977 123.74395209 33.09641691 35.75502424 0.70153571 5.63813180 1.05913605 208.38385992 1.85207460 3.66699882 145.99873635 97.49597395 12.92414664 19.66486506 14.21116898 9.36085898 34.91042400 89.29766687 8.12814798 47.36545466 16.65244685 0.31830492 16.67564969 8.22938483 4.09541988 8.55337692 19.71664117 11.86469977 35.82397612 102.33219778 122.76298076 53.84391398 338.75142172 914.04236263 919.59411537 14.42623483 21.11449978 101.09863022 12.90128166 18.47662029 7.27207472 0.73114225 5.30985842 58.21710729 1.77541967 0.84990223 0.27019862 23.49017801 2.78477397 7.85370059 4.77041139 0.30047117 km.mole-1
press: 1.00000000 atm
temp: 298.15000000 k
moi: 6295.38119401 16890.21580437 19445.24530981
symmnumber: 1
pointgroup: NOSYM
transl: 44.264528 cal.mol-1.K-1
rotat: 35.981401 cal.mol-1.K-1
vibrat: 106.331503 cal.mol-1.K-1
total: 186.577432 cal.mol-1.K-1
transl: 0.888729 kcal.mol-1
rotat: 0.888729 kcal.mol-1
vibrat: 205.443972 kcal.mol-1
total: 207.221425 kcal.mol-1
transl: 2.980671 cal.mol-1.K-1
rotat: 2.980671 cal.mol-1.K-1
vibrat: 91.164596 cal.mol-1.K-1
total: 97.125937 cal.mol-1.K-1
mdcq: 0.75019637 0.02523944 -0.14187777 -0.22035315 -0.26207989 0.07149437 -0.54593167 0.17147991 -0.44766976 0.22461621 -0.13657256 0.24356998 -0.18774035 0.13335078 0.23286700 0.07235030 0.19021632 -0.04134884 -0.03234036 -0.04617853 0.36359617 0.19312725 0.01577393 0.00328146 0.23902494 -0.01905265 -0.04666381 -0.02531169 0.23526256 -0.04374555 -0.01530641 -0.03697541 0.23820130 -0.02162138 -0.01718482 -0.02049402 -0.72837376 0.69398162 -0.52158143 -0.34856645 0.17004000 -0.36069967
eener: -219.695345 electronvolt
kinener: 251.446098 electronvolt
coulombener: -49.447741 electronvolt
xcener: -237.533615 electronvolt
dispener: -2.397955 electronvolt
total: -257.628558 electronvolt
charge: 0.73501474 -0.06543001 -0.31640817 -0.20356863 -0.40227964 -0.43689999 -0.56055863 0.10534094 0.21976899 -0.14452035 0.23727556 -0.17851448 0.17692062 -0.16158474 0.17582068 0.17224972 0.41459998 -0.16000012 -0.12563154 -0.11372883 0.56107123 0.38457197 -0.08964477 -0.08982140 0.67670049 -0.13832069 -0.03571793 -0.15407655 0.67928674 -0.03904714 -0.13830417 -0.15404393 0.66649751 -0.13247240 -0.12756842 -0.12849621 -0.55801396 0.53876724 -0.53580358 -0.54623313 0.51981958 -0.52701658
dipole: -3.11135026 -8.08191544 0.29151618
dipole: 8.087171
quadrupole: -16.36291459 -76.69110028 -119.25554138 -87.31477207 -252.86777713 103.67768666
charge: 0
converged: GEOMETRY CONVERGED
charge: 0.7350 -0.0654 -0.3164 -0.2036 -0.4023 -0.4369 -0.5606 0.1053 0.2198 -0.1445 0.2373 -0.1785 0.1769 -0.1616 0.1758 0.1722 0.4146 -0.1600 -0.1256 -0.1137 0.5611 0.3846 -0.0896 -0.0898 0.6767 -0.1383 -0.0357 -0.1541 0.6793 -0.0390 -0.1383 -0.1540 0.6665 -0.1325 -0.1276 -0.1285 -0.5580 0.5388 -0.5358 -0.5462 0.5198 -0.5270
