program: AMS
title: Zn complexes
programVersion: 2023.104
runtype: SINGLE POINT
method: DFT
basis: TZP
functional: VWN
spinMolecule: Restricted
epsl: 46.70000
solvent: DMSO angstrom
formula: C14H17BrN6O3Zn
InChI: InChI=1S/C12H17BrN4O.2CNO.Zn/c1-9(10-6-5-7-11(13)14-10)15-16-12(18)8-17(2,3)4;2*2-1-3;/h5-7H,8H2,1-4H3;;;/q-2;;;+2
42 atoms
Zn 3.274561 4.831244 9.875904
Br 4.989025 7.507168 7.860751
N  3.907816 4.946998 7.616093
N  2.790782 3.005917 9.043314
N  2.257368 2.045570 9.861510
N  1.216888 0.130646 11.781052
O  2.410726 3.669792 11.546379
C  4.446919 5.922311 6.909488
C  4.661128 5.888903 5.527785
H  5.109213 6.735176 5.011863
C  4.278026 4.730083 4.859612
H  4.420848 4.649239 3.782312
C  3.715697 3.675655 5.579788
H  3.415094 2.762127 5.072511
C  3.539887 3.810410 6.961593
C  2.952328 2.735550 7.777675
C  2.579143 1.432712 7.145032
H  2.201807 0.741127 7.901833
H  3.449028 0.982667 6.645885
H  1.803085 1.584221 6.381018
C  2.123225 2.508050 11.108764
C  1.557558 1.563868 12.165044
H  2.281222 1.500279 12.986747
H  0.635457 2.005703 12.562975
C  2.438509 -0.611524 11.290697
H  3.199403 -0.574276 12.075841
H  2.791810 -0.119626 10.382777
H  2.145540 -1.646850 11.095492
C  0.126191 0.085407 10.735826
H  0.496817 0.583332 9.838249
H  -0.751331 0.603020 11.134126
H  -0.108336 -0.964967 10.541743
C  0.710376 -0.556017 13.027125
H  0.460966 -1.588967 12.768535
H  -0.178740 -0.027320 13.381384
H  1.498537 -0.533420 13.784860
N  1.952123 6.264361 9.823344
C  1.719059 7.353656 9.377340
O  1.426766 8.452124 8.955905
N  5.021280 5.148672 10.688094
C  5.714301 6.078874 11.000076
O  6.451939 6.979828 11.335438
elementType: Zn Br N N N N O C C H C H C H C C C H H H C C H H C H H H C H H H C H H H N C O N C O
mdcq: 0.86403687 0.00503546 -0.20744439 -0.28042079 -0.30538095 0.07312311 -0.71690632 -0.04841431 0.33824626 -0.27105825 1.17236271 -0.10453525 -2.13189049 0.75957930 0.62728715 0.08422226 0.25554201 0.03765448 -0.04384954 -0.02162994 0.44380918 0.20824437 0.02454898 0.00801720 0.24596625 -0.00865049 -0.05041741 -0.00020114 0.24002888 -0.06198653 -0.00710450 -0.01100266 0.24191746 -0.00124799 -0.00343015 -0.00686872 -0.84129105 0.79199649 -0.64129813 -0.41011554 0.21962914 -0.46610305
eener: -222.290019 electronvolt
kinener: 301.574258 electronvolt
coulombener: -76.994867 electronvolt
xcener: -372.265728 electronvolt
solvener: -2.751889 electronvolt
dispener: 0.000000 electronvolt
total: -372.728238 electronvolt
charge: 0.85009664 -0.12270023 -0.36702596 -0.25950879 -0.39781500 -0.42135176 -0.72294049 0.13520036 0.20895157 -0.12595796 0.24770207 -0.14397028 0.18420612 -0.11864310 0.21127753 0.25358559 0.37595308 -0.12663317 -0.10702087 -0.10600474 0.58338673 0.41237062 -0.07447776 -0.07301640 0.67239986 -0.12346442 -0.05998850 -0.12506622 0.67152642 -0.05585766 -0.12414684 -0.12620541 0.66584321 -0.11445043 -0.11872504 -0.11877694 -0.61595345 0.58803936 -0.64217264 -0.62781946 0.59902639 -0.63987199
dipole: -3.66685067 -12.26501311 -1.60867682
dipole: 12.370060
quadrupole: 42.62421699 -112.05033635 -156.42217590 -132.97884595 -400.45632164 90.35462896
charge: 0
charge: 0.8501 -0.1227 -0.3670 -0.2595 -0.3978 -0.4214 -0.7229 0.1352 0.2090 -0.1260 0.2477 -0.1440 0.1842 -0.1186 0.2113 0.2536 0.3760 -0.1266 -0.1070 -0.1060 0.5834 0.4124 -0.0745 -0.0730 0.6724 -0.1235 -0.0600 -0.1251 0.6715 -0.0559 -0.1241 -0.1262 0.6658 -0.1145 -0.1187 -0.1188 -0.6160 0.5880 -0.6422 -0.6278 0.5990 -0.6399
