program: AMS
title: Ligands
programVersion: 2023.104
runtype: GEOMETRY OPTIMIZATION
runtype: FREQUENCIES
method: DFT
functional: Becke88 Perdew86
functional: VWN
spinMolecule: Restricted
epsl: 46.70000
solvent: DMSO angstrom
formula: C16H29BrN4O3S2Zn
InChI: InChI=1S/C12H17BrN4O.2C2H6OS.Zn/c1-9(10-6-5-7-11(13)14-10)15-16-12(18)8-17(2,3)4;2*1-4(2)3;/h5-7H,8H2,1-4H3;2*1-2H3;/q-3;2*-1;+5
56 atoms
Zn 3.491678 2.335477 4.034176
Br 4.356784 -0.510457 6.080835
O  3.411792 3.572452 2.218360
N  3.087437 1.962788 6.147614
N  2.575991 4.053243 4.629367
N  2.475945 5.096344 3.748289
N  4.264431 6.272472 1.034220
H  4.676920 1.636477 1.169860
H  5.839225 5.588309 -0.211369
H  4.185704 5.236596 -0.818306
H  1.688012 0.861968 0.488829
C  4.831414 5.265398 0.063598
H  4.843835 4.291665 0.557154
C  3.322700 0.883016 6.881947
C  2.880935 0.718264 8.199002
H  3.103269 -0.195114 8.745793
C  2.163442 1.764641 8.767331
H  1.796459 1.680178 9.789608
C  1.925511 2.923162 8.023769
H  1.374518 3.754759 8.456333
C  2.398000 2.997467 6.712898
C  2.189462 4.189238 5.866380
C  1.592017 5.434713 6.428256
H  1.627641 6.233288 5.682541
H  2.136231 5.746383 7.330342
H  0.545246 5.262391 6.719895
C  2.944579 4.723141 2.550395
C  2.882971 5.833404 1.520548
H  2.324349 5.518366 0.631920
H  2.409266 6.712299 1.967587
C  5.205631 6.440751 2.200692
H  4.742740 7.109278 2.931300
H  6.138370 6.868960 1.824336
H  5.395365 5.459343 2.643154
C  4.107553 7.598251 0.330185
H  3.372386 7.481191 -0.470556
H  5.079561 7.882606 -0.082416
H  3.768431 8.340592 1.058083
O  5.471878 2.133261 3.982648
S  6.221592 2.604939 2.684580
C  7.898693 2.010307 2.972319
H  8.307107 2.596514 3.801338
H  8.473944 2.195410 2.056949
H  7.860723 0.942262 3.213678
C  5.730371 1.436987 1.390404
H  5.876873 0.415071 1.756528
H  6.350454 1.638488 0.507962
O  2.792324 0.644534 3.253355
S  1.328105 0.354940 2.776235
C  0.253216 1.297211 3.885508
H  0.389281 0.880256 4.888442
H  -0.780923 1.145734 3.554621
H  0.521710 2.360059 3.847815
C  1.095001 1.340112 1.275044
H  1.439886 2.363356 1.462125
H  0.029409 1.306640 1.018082
zeropoint: 11.858471 electronvolt
frequency: 29.29788586 33.69169751 12.44117775 23.51645040 32.78165360 38.80247460 44.73331809 48.25470917 50.86784572 60.42991075 78.63247721 83.40093729 91.24516177 97.40541097 112.05705120 114.03441893 125.09243141 128.53731486 152.73308609 156.22283313 157.89281734 163.70004891 172.86848683 180.55366279 193.99681097 204.99523380 205.83237285 215.21281180 220.65034192 230.79461999 242.65973482 264.95259693 274.14034712 275.87584689 285.00165801 289.59451211 295.50873571 308.77792646 321.00406137 326.89175927 337.36504613 348.29734778 361.29534425 375.88276435 407.34344354 411.97084147 425.40411571 432.02173717 442.17925812 450.68997035 484.38724444 498.42179413 527.90288113 607.59260113 633.26741054 634.60720837 638.38500025 644.95619509 666.81715494 675.47837734 697.49596570 714.76117634 728.74900961 773.34288119 775.01707688 815.78457873 871.99985937 882.14189006 882.39394766 884.88254405 886.43215478 897.54471842 899.78349945 914.12834102 921.42688689 940.06889245 953.83084237 956.87697167 963.78813686 969.96920607 973.14230000 986.83151270 1006.25542647 1007.61873216 1009.92561643 1011.11413699 1039.34096033 1061.11699344 1083.77876360 1094.72504781 1100.83475935 1107.70440502 1143.49030514 1172.83753220 1176.58625137 1216.65892237 1247.44814165 1270.78914706 1273.03936378 1273.56563492 1290.27138757 1292.29093802 1294.02133918 1300.67932783 1314.72655765 1342.26881306 1364.89243488 1379.76250921 1382.90412939 1386.15121534 1390.64171251 1392.33255969 1393.71672315 1395.53293885 1397.41875620 1399.04022185 1410.81310945 1411.54407483 1414.91778688 1415.31489142 1417.40077133 1422.40967380 1424.02138177 1428.03782655 1434.64033711 1435.90281516 1448.76054494 1456.39061369 1467.99690330 1498.36107958 1534.00889804 1566.50371016 1588.89569128 2966.13360620 2972.62887178 2975.07855616 2976.15516491 2978.31116724 3000.74869309 3003.04963254 3006.61830217 3015.81090749 3023.69106819 3075.83336184 3080.40090076 3083.67636884 3083.74021001 3085.45598839 3089.49244956 3091.51244433 3091.85642840 3096.73272987 3098.14837847 3101.27595845 3102.29793429 3104.08845352 3104.96041197 3107.69184822 3119.42905355 3126.48235470 3148.47815629 3151.02004383 cm-1
elementType: Zn Br O N N N N H H H H C H C C H C H C H C C C H H H C C H H C H H H C H H H O S C H H H C H H O S C H H H C H H
absortion: 2.35347217 1.71271169 6.46864936 0.69713286 1.39648694 4.94894952 5.49781315 0.44277829 0.86881481 0.85797693 2.80663893 1.66103492 2.34143229 6.17745207 9.01684637 0.38189118 3.00083588 0.89179415 1.90775932 7.46110921 3.48638286 23.20783975 1.21412137 26.20477518 3.33673442 3.58080792 11.02117064 12.09547114 6.92162844 3.98319570 34.59199292 5.85775141 1.12157896 2.16763010 20.62795272 6.99425964 13.36150881 7.94551829 20.50274755 33.48611330 11.21572490 2.46418788 5.59201528 18.35746039 56.05499450 1.31726919 1.07336466 2.62539578 29.59896463 62.76650960 1.97172922 2.00480616 0.75919756 0.42793499 4.23601357 4.62623455 5.19104578 38.15708124 17.16142450 15.68323907 83.24554757 14.79101090 16.14392042 44.10854013 23.12887605 38.26077894 86.29497839 50.41967761 7.20502262 161.27404567 223.64645821 145.72328801 68.90533502 15.09090985 44.40579183 34.64380045 45.55715470 99.19111507 131.21157479 7.01697739 0.17032885 4.11388528 68.45666992 37.12921002 19.18788355 39.30972370 0.61283744 167.72159068 1.11884058 42.23277107 1.66651630 191.51325354 72.57976823 102.80447178 7.26118475 18.45354542 7.43739322 181.18914847 7.22589531 6.94602371 3.97464255 4.12318019 13.26606780 131.77236653 126.97290454 44.19766330 55.13462170 1.46513293 21.13481449 41.92666222 44.29203625 14.08738671 26.39153608 134.32904551 1.37493801 48.14845406 30.98493586 40.37705978 100.54132876 56.97221669 46.93706063 6.52777887 23.11695157 11.19323529 9.95124422 4.95379954 31.71706149 42.44558383 86.72826740 810.09662269 323.67752791 96.13642021 17.99572275 9.01285990 0.98877953 6.91235347 1.82733913 1.87292875 5.40774239 15.53581037 14.73932691 11.62544037 5.36881137 1.35720990 0.50982305 1.32133424 0.86598425 0.43740304 5.72476873 0.29690966 1.99358991 0.26105730 1.29622207 0.40244773 1.76259011 5.97993837 6.94784931 2.77333322 2.92093935 10.07364084 0.76400320 1.15288750 km.mole-1
press: 1.00000000 atm
temp: 298.15000000 k
moi: 9844.41586496 17681.98513617 19751.19605852
symmnumber: 1
pointgroup: NOSYM
transl: 44.697509 cal.mol-1.K-1
rotat: 36.483409 cal.mol-1.K-1
vibrat: 136.985347 cal.mol-1.K-1
total: 218.172541 cal.mol-1.K-1
transl: 0.888729 kcal.mol-1
rotat: 0.888729 kcal.mol-1
vibrat: 293.303180 kcal.mol-1
total: 295.080639 kcal.mol-1
transl: 2.980671 cal.mol-1.K-1
rotat: 2.980671 cal.mol-1.K-1
vibrat: 117.827479 cal.mol-1.K-1
total: 123.788820 cal.mol-1.K-1
mdcq: 0.82468392 0.04516123 -0.53012395 -0.23503454 -0.13742487 -0.36579319 0.07058710 0.14153295 -0.00749384 0.01422271 0.28286090 0.24088787 -0.09105014 0.14431749 -0.15291631 0.12732227 -0.02830632 0.15408868 0.02517000 0.07945818 0.09073012 0.11653050 0.08279089 -0.00181121 0.06524003 -0.00148680 0.32255476 0.22025894 0.02410789 -0.03231331 0.23545862 0.01083134 0.00729898 -0.07907076 0.24006004 0.00562278 -0.00324694 0.00199479 -0.69494813 0.93088220 -1.18998758 0.38541298 0.33561301 0.44366647 -0.26200401 0.10893001 0.11979961 -0.62640918 0.64280311 -0.76694286 0.26021058 0.30511125 0.25712619 -0.70954564 0.30702565 0.24555554
eener: -245.977094 electronvolt
kinener: 293.077302 electronvolt
coulombener: -67.862120 electronvolt
xcener: -273.341662 electronvolt
solvener: -6.063326 electronvolt
dispener: -3.107722 electronvolt
total: -303.274610 electronvolt
charge: 0.90576384 -0.05961069 -0.68385288 -0.38322459 -0.25120605 -0.30358218 -0.46799319 -0.04298594 -0.13380731 -0.13486561 -0.09285068 0.70944039 -0.05607445 0.10925272 0.22904099 -0.11741339 0.26235579 -0.14803762 0.21794176 -0.12583128 0.19807988 0.21088120 0.40335595 -0.12988276 -0.09564604 -0.09311686 0.47667917 0.45921958 -0.08218748 -0.09364800 0.71191608 -0.11606451 -0.12999545 -0.08979049 0.68326076 -0.11778940 -0.11526951 -0.12026291 -0.76219250 0.84192756 0.27546473 -0.08052051 -0.07332267 -0.07120750 0.27662191 -0.06383125 -0.07354663 -0.73496209 0.74833048 0.30562739 -0.07799006 -0.06695506 -0.04705339 0.29711813 -0.00962953 -0.07607788
dipole: 13.35056472 14.36390961 10.70573304
dipole: 17.914648
quadrupole: 0.47743646 161.98176165 72.20038829 16.90654039 83.26562525 -17.38397685
charge: 2
converged: GEOMETRY CONVERGED
charge: 0.9058 -0.0596 -0.6839 -0.3832 -0.2512 -0.3036 -0.4680 -0.0430 -0.1338 -0.1349 -0.0929 0.7094 -0.0561 0.1093 0.2290 -0.1174 0.2624 -0.1480 0.2179 -0.1258 0.1981 0.2109 0.4034 -0.1299 -0.0956 -0.0931 0.4767 0.4592 -0.0822 -0.0936 0.7119 -0.1161 -0.1300 -0.0898 0.6833 -0.1178 -0.1153 -0.1203 -0.7622 0.8419 0.2755 -0.0805 -0.0733 -0.0712 0.2766 -0.0638 -0.0735 -0.7350 0.7483 0.3056 -0.0780 -0.0670 -0.0471 0.2971 -0.0096 -0.0761
