program: AMS
title: Zn
programVersion: 2023.104
runtype: SINGLE POINT
method: DFT
basis: TZP
functional: VWN
spinMolecule: Restricted
epsl: 32.60000
solvent: Methanol angstrom
formula: N3
InChI: InChI=1S/N3/c1-3-2
3 atoms
N  0.000000 -0.000000 0.000000
N  -0.000000 0.000000 1.193859
N  0.000000 -0.000000 -1.193859
elementType: N N N
mdcq: 0.72725103 -0.86362551 -0.86362551
eener: -22.129533 electronvolt
kinener: 28.045905 electronvolt
coulombener: -0.980504 electronvolt
xcener: -41.680561 electronvolt
solvener: -2.899320 electronvolt
dispener: 0.000000 electronvolt
total: -39.644014 electronvolt
charge: 0.14447739 -0.57223870 -0.57223870
dipole: 0.00000000 0.00000000 0.00000000
dipole: 0.000000
quadrupole: 4.39559151 0.00000000 0.00000000 4.39559151 0.00000000 -8.79118303
energy: -395.201711 -391.156096 -31.185058 -13.784224 7.799014 9.603938 17.780395 39.476188 56.718039 96.473075 167.426740 193.810172 271.995241 1742.225191 1948.695446 -391.157383 -26.451160 -12.248849 5.987856 14.661954 27.455980 38.375855 67.059945 119.540445 196.514902 250.576461 1896.460840 -7.242035 12.739179 35.800158 78.098016 115.921634 -7.242035 12.739179 35.800158 78.098016 115.921634 -14.091569 2.906017 9.391674 18.623350 56.101562 91.326670 120.857450 -14.091569 2.906017 9.391674 18.623350 56.101562 91.326670 120.857450 30.345505 52.444470 30.345505 52.444470 40.024521 40.024521 electronvolt
charge: -1
energy: -395.2015 -391.1572 -391.1559 -31.1850 -26.4511 -14.0916 -13.7842 -12.2488 -7.2420 2.9060 5.9879 7.7990 9.3917 9.6039 12.7392 14.6619 17.7804 18.6233 27.4560 30.3455 35.8001 38.3758 39.4762 40.0245 52.4444 56.1015 56.7180 67.0599 78.0980 91.3266 96.4730 115.9216 119.5404 120.8574 167.4267 193.8101 196.5148 250.5763 271.9951 1742.2243 1896.4598 1948.6944 electronvolt
