program: AMS
programVersion: 2023.104
runtype: SINGLE POINT
method: DFT
basis: TZP
functional: VWN
spinMolecule: Restricted
epsl: 78.39000
solvent: Water angstrom
formula: H2O
InChI: InChI=1S/H2O/h1H2
3 atoms
O  0.000000 0.000000 0.128984
H  -0.000000 0.764068 -0.480110
H  0.000000 -0.764068 -0.480110
elementType: O H H
mdcq: -0.80258411 0.40129206 0.40129206
eener: -6.480857 electronvolt
kinener: 16.305718 electronvolt
coulombener: -10.391377 electronvolt
xcener: -20.594394 electronvolt
solvener: -0.332414 electronvolt
dispener: 0.000000 electronvolt
total: -21.493321 electronvolt
charge: -0.70143974 0.35071987 0.35071987
dipole: 0.00000000 0.00000000 -0.92038300
dipole: 0.920383
quadrupole: -1.95240896 0.00000000 0.00000000 2.13912686 -0.00000000 -0.18671790
energy: -523.283452 -29.926983 -13.052750 0.943664 8.525227 10.544330 15.013480 26.031472 36.857497 51.983051 52.935605 64.458593 137.831440 439.508927 3518.235473 17.677205 47.341693 -10.889751 12.277160 20.578604 47.485064 111.662511 -16.362075 2.857271 8.698353 16.197034 31.350647 35.954672 72.287808 76.959289 157.245729 electronvolt
charge: 0
energy: -523.2832 -29.9270 -16.3621 -13.0527 -10.8897 0.9437 2.8573 8.5252 8.6983 10.5443 12.2772 15.0135 16.1970 17.6772 20.5786 26.0315 31.3506 35.9547 36.8575 47.3417 47.4850 51.9830 52.9356 64.4586 72.2878 76.9592 111.6625 137.8314 157.2456 439.5087 3518.2336 electronvolt
