program: AMS
programVersion: 2023.104
runtype: SINGLE POINT
method: DFT
basis: TZP
functional: VWN
spinMolecule: Restricted
epsl: 78.39000
solvent: Water angstrom
formula: C12H17BrN4O
InChI: InChI=1S/C12H17BrN4O/c1-9(10-6-5-7-11(13)14-10)15-16-12(18)8-17(2,3)4/h5-7H,8H2,1-4H3
35 atoms
H  2.870498 8.187435 -0.190832
Br 2.716990 -1.153877 5.667255
O  4.076516 4.157694 1.954531
N  2.758877 1.628436 5.854828
N  2.800875 3.896284 4.344086
N  2.610669 5.032272 3.590236
N  3.958847 7.197663 1.341764
H  4.541428 6.493033 -0.572475
H  5.819230 7.370009 0.337149
H  5.347307 5.688770 0.814528
H  4.193880 9.152026 0.547283
H  2.666647 8.881491 1.453847
C  5.004818 6.643107 0.407355
C  2.824771 0.555573 6.605708
C  2.960448 0.516581 7.995668
H  3.000464 -0.423809 8.540973
C  3.036289 1.755237 8.630068
H  3.145233 1.805707 9.713690
C  2.973078 2.923985 7.871135
H  3.035728 3.892749 8.361793
C  2.832867 2.840739 6.474494
C  2.757127 4.057134 5.639836
C  2.653821 5.392894 6.327287
H  2.498906 6.174756 5.578166
H  3.576600 5.619262 6.883418
H  1.825653 5.404523 7.050527
C  3.222932 4.992246 2.397938
C  2.820965 6.188709 1.536052
H  2.527131 5.868776 0.529052
H  2.004357 6.740812 2.010794
C  4.591566 7.535001 2.666501
H  3.808185 7.875765 3.349065
H  5.329243 8.324599 2.499367
H  5.075576 6.639201 3.063269
C  3.376750 8.451128 0.742035
elementType: H Br O N N N N H H H H H C C C H C H C H C C C H H H C C H H C H H H C
mdcq: 0.00291692 -0.11370339 -0.80006295 -0.79855076 -0.29994750 -0.52476304 0.05444712 -0.00625824 -0.01046117 -0.01883844 -0.01073471 -0.00539256 0.24494888 0.77799245 -1.62851738 0.66972414 0.83482264 -0.15366953 0.08605673 0.01366167 0.20927745 0.22140038 0.00993673 -0.04824596 0.02725554 0.03515270 0.55146433 0.19787957 0.01928577 -0.04517347 0.24653751 -0.00017407 0.00103818 0.01662951 0.24406499
eener: -169.317213 electronvolt
kinener: 243.029138 electronvolt
coulombener: -73.900525 electronvolt
xcener: -294.409833 electronvolt
solvener: -2.332316 electronvolt
dispener: 0.000000 electronvolt
total: -296.930759 electronvolt
charge: -0.11460855 -0.15907154 -0.77700045 -0.34628029 -0.23381969 -0.40016241 -0.42175092 -0.12144018 -0.12127283 -0.08196279 -0.11690097 -0.11618675 0.67378743 0.12912142 0.16723037 -0.12518035 0.23338927 -0.14587413 0.16123901 -0.11813764 0.17184794 0.12928106 0.35466014 -0.14056744 -0.11151273 -0.11557592 0.48024974 0.44461003 -0.10324529 -0.10543510 0.68863944 -0.10549529 -0.12598131 -0.10528924 0.67869593
dipole: 1.07265504 6.84089767 -0.61869445
dipole: 6.868818
quadrupole: -70.93587416 85.95572407 2.45122070 112.30639240 21.00479582 -41.37051824
charge: 0
charge: -0.1146 -0.1591 -0.7770 -0.3463 -0.2338 -0.4002 -0.4218 -0.1214 -0.1213 -0.0820 -0.1169 -0.1162 0.6738 0.1291 0.1672 -0.1252 0.2334 -0.1459 0.1612 -0.1181 0.1718 0.1293 0.3547 -0.1406 -0.1115 -0.1156 0.4802 0.4446 -0.1032 -0.1054 0.6886 -0.1055 -0.1260 -0.1053 0.6787
