program: Gaussian 09
title: opt freq
version: AM64L-G09RevB.01
method: RTPSSTPSS
basis: def2TZV
operation: Freq
keyword: #P
keyword: Geom=AllCheck
keyword: Guess=TCheck
keyword: SCRF=Check
keyword: GenChk
keyword: RTPSSTPSS/def2TZV
keyword: Freq
multiplicity: 1
elementType: C C C C C C C C C C C H C C C H H H H H H H H H
converged: YES YES YES YES
title: Mulliken atomic charges:
charge: -0.126651 -0.366721 0.397305 0.395935 -0.366969 -0.127563 -0.633652 -0.633646 0.397303 0.395925 -0.366967 0.170638 -0.127562 -0.126653 -0.366724 0.169494 0.158740 0.170661 0.170639 0.158786 0.169494 0.158787 0.158740 0.170661
chargesum: 0.00000
title: Mulliken charges with hydrogens summed into heavy atoms:
elementType: C C C C C C C C C C C C C C
charge: 0.032089 -0.196060 0.397305 0.395935 -0.196330 0.031223 -0.464158 -0.464153 0.397303 0.395925 -0.196329 0.031225 0.032088 -0.196063
polarizability: 4.03818845e+02 8.38452479e+01 3.10351795e+02 8.22112358e-01 -2.42280484e-01 1.08366438e+02
1716.lowfreq: -18.5044 -14.7814 0.0003 0.0003 0.0005 20.5700 87.9885 115.2929 226.9836
frequency: 87.9885 115.2929 226.9836 230.6874 257.4868 372.4046 380.3429 389.2241 461.1346 470.3495 478.8142 522.1356 548.2819 607.4001 627.6611 642.8056 651.7197 656.7249 739.4774 740.7936 769.9494 789.4625 849.4199 858.6595 877.5879 889.6771 909.7390 920.9407 964.4012 965.6761 980.3979 982.5056 999.8856 1005.1193 1098.8765 1155.9027 1167.4275 1175.3432 1180.2706 1209.3999 1269.1179 1277.5358 1280.5257 1312.5633 1358.1448 1386.1538 1387.2037 1409.0469 1461.7290 1462.8399 1490.8227 1532.2525 1539.3253 1571.5506 1610.7200 1614.0732 3103.2616 3105.5420 3105.9532 3106.1382 3110.4992 3111.3434 3125.8817 3125.9636 3141.2567 3141.9364
redmass: 4.9282 3.7004 4.4616 4.7921 3.7949 3.2483 4.5080 6.6571 2.4946 2.8646 3.9409 6.2833 4.0952 6.7663 6.6808 7.7214 6.1108 7.5284 1.1942 5.7899 1.3350 3.6350 1.2507 1.3274 1.2604 1.4666 5.5169 5.4863 1.3224 1.3417 1.2094 1.2145 2.5184 2.6218 2.4891 1.4853 1.1736 1.7164 1.0769 1.2485 3.0263 2.6266 1.4746 2.6226 3.5289 10.5035 4.0390 1.4834 1.7905 2.1346 2.2615 4.3511 6.7789 4.4361 5.5883 5.2390 1.0900 1.0908 1.0858 1.0863 1.0877 1.0876 1.0941 1.0942 1.0981 1.0980
irintensity: 2.2746 0.0075 4.5679 0.0000 0.0000 0.0559 0.0000 0.0000 40.4949 0.0000 0.0154 0.0000 0.0000 20.4051 0.0000 0.0000 0.0330 0.0022 182.8224 0.0000 0.0000 2.0973 0.0000 0.0083 0.0000 154.2350 3.8056 0.0000 0.0000 9.7480 0.0000 0.0004 32.2867 0.0000 0.0000 14.2131 0.4822 8.4850 0.0000 0.0000 0.0000 9.7021 0.0000 4.8796 13.4941 0.0000 0.6280 0.0000 3.9331 7.1025 0.0000 20.2482 0.0000 0.0000 0.0000 4.9276 36.6882 0.0000 0.0001 40.4765 0.0429 0.0000 0.0005 150.0761 162.5977 0.0000
temp: 298.150 k
press: 1.00000 atm
elementType: 6 6 6 6 6 6 6 6 6 6 6 1 6 6 6 1 1 1 1 1 1 1 1 1
symmnumber: 1
zpe: 497046.8 jmol-1
zpe.correction: 0.189315 hartree
zpe.thermalcorrener: 0.199129 hartree
zpe.thermalcorrenthalpy: 0.200073 hartree
zpe.thermalcorrgfe: 0.154253 hartree
zpe.sumelectzpe: -539.474386 hartree
zpe.sumelectthermal: -539.464572 hartree
zpe.sumelectthermalent: -539.463627 hartree
zpe.sumelectthermalfe: -539.509448 hartree
dipole: 0.0000 0.0000 -0.0001
dipole: 0.0001
quadrupole: -68.0596 -68.3060 -88.8941
quadrupole: 0.2109 0.0727 -0.0560
quadrupole: 7.0269 6.7806 -13.8075 0.2109 0.0727 -0.0560
hfenergy: -539.6637007 hartree
pointgroup: C01 [X(C14H10)]
dipole: 0.0000045 0.0000004 -0.000057 debye
dipolederiv: -0.1608099 0.0167315 -0.0000597 -0.0993558 0.1373492 -0.0012713 -0.0003226 -0.0018945 -0.1973679 -0.0024466 -0.0882854 0.0010838 0.0218762 0.1647802 -0.0009174 0.0005774 -0.0008299 -0.21438 0.1106481 0.2000404 -0.0003558 0.1098444 -0.0766786 0.0008437 0.0003897 0.0009305 0.0587517 0.0995628 0.1161074 -0.0000664 0.2058537 -0.0649968 0.0011687 -0.000352 0.0004245 0.0584917 0.0947616 -0.0317736 0.0010993 -0.1416711 0.0663944 -0.0013918 0.0019751 -0.0005131 -0.215131 0.0261655 -0.2070422 0.0015971 -0.0924753 -0.0566276 -0.0007322 0.0009815 -0.0011674 -0.2009561 -0.0270393 -0.1709954 0.0011715 -0.1719292 0.1658283 -0.0018074 0.0011796 -0.0014254 -0.2419361 -0.0270499 -0.1709959 0.0011638 -0.1719344 0.1658265 -0.0017893 0.0011768 -0.0014385 -0.2419325 0.1106539 0.2000425 -0.0003249 0.1098461 -0.0766782 0.0008265 0.0004245 0.0009317 0.0587497 0.0995575 0.1161015 -0.0001137 0.2058475 -0.0650035 0.001149 -0.0004548 0.0004023 0.0584934 0.0947672 -0.0317693 0.001059 -0.141668 0.0663972 -0.0013903 0.0018841 -0.0005414 -0.2151312 0.000008 0.0720689 -0.00085 0.1740628 -0.0825382 0.0013471 -0.0012953 0.0010051 0.1883455 0.0261658 -0.2070432 0.0015281 -0.092477 -0.0566303 -0.0007134 0.001023 -0.0010764 -0.200957 -0.1608093 0.0167289 -0.0000877 -0.0993543 0.1373523 -0.0012808 -0.0004092 -0.0019119 -0.1973681 -0.0024538 -0.0882847 0.0010226 0.021876 0.1647829 -0.0008732 0.0006387 -0.0008046 -0.2143813 0.0195661 0.1086989 -0.0008842 0.1102444 -0.104541 0.0011722 -0.0009515 0.001294 0.1879222 0.0190123 -0.138879 -0.0002434 -0.1614893 -0.134025 0.0003245 -0.0001516 0.0004616 0.1934736 0.0425154 0.1483851 -0.00095 0.048792 -0.1258326 0.0010436 -0.0006088 0.00152 0.188406 0.0000085 0.0720686 -0.0008741 0.1740628 -0.0825376 0.0013704 -0.0013587 0.0010115 0.1883452 -0.2219413 -0.0250531 -0.0014789 -0.0037484 0.1108923 0.0002091 -0.0013338 0.0001934 0.1943795 0.0195695 0.1086937 -0.0008827 0.1102462 -0.1045437 0.0011629 -0.0009967 0.0012852 0.1879225 -0.2219407 -0.0250526 -0.0014168 -0.0037505 0.1108923 0.0002047 -0.0013044 0.000186 0.1943801 0.0190129 -0.1388764 -0.0002202 -0.1614907 -0.1340274 0.0003381 -0.0001122 0.0004823 0.1934737 0.0425156 0.1483833 -0.0009168 0.0487919 -0.1258354 0.0010068 -0.0005986 0.0014752 0.1884065 unknown
polarizability: 403.8188449|83.8452479|310.3517953|0.8221124|-0.2422805|108.3664384 unknown
InChI: InChI=1S/C14H10/c1-2-6-12-10-14-8-4-3-7-13(14)9-11(12)5-1/h1-10H
charge 0 multiplicity 1
24 atoms
C  -3.17457443 -3.3070649 0.00571249
C  -1.79658443 -3.30830277 0.01074536
C  -1.05869094 -2.07695266 0.00990413
C  -1.79577636 -0.82365404 0.00410088
C  -3.23049969 -0.86921857 -0.00114111
C  -3.89983414 -2.07366658 -0.00030865
C  0.34846837 -2.04585301 0.01486818
C  -1.08449782 0.39089778 0.00335018
C  0.32266112 0.42199816 0.00833013
C  1.05974774 -0.83130178 0.01404664
C  2.49447266 -0.7857409 0.01905797
H  3.04338738 -1.72398661 0.02351831
C  3.16380945 0.41870484 0.01811515
C  2.43854952 1.65210464 0.01225862
C  1.06055811 1.65334733 0.00748048
H  0.90024949 -2.98337613 0.01938765
H  -3.72211294 -4.24495765 0.00636214
H  -1.24374719 -4.24420858 0.0153749
H  -3.77941304 0.06902761 -0.00570782
H  -4.98568172 -2.09584021 -0.00416443
H  -1.6362643 1.32842948 -0.00116906
H  4.24965743 0.44088376 0.02181035
H  2.98608119 2.59000143 0.01150941
H  0.50772629 2.58925718 0.0030201
