program: Gaussian 09
title: opt freq
version: AM64L-G09RevB.01
method: RTPSSTPSS
basis: def2TZV
operation: Freq
keyword: #P
keyword: Geom=AllCheck
keyword: Guess=TCheck
keyword: SCRF=Check
keyword: GenChk
keyword: RTPSSTPSS/def2TZV
keyword: Freq
multiplicity: 1
elementType: C C C C C C H H H H H C C H H H O H
converged: YES YES YES YES
title: Mulliken atomic charges:
charge: -0.177258 0.023800 0.052704 -0.054449 -0.159289 -0.055817 0.180326 0.222619 0.204385 0.181403 0.180701 -0.031978 -0.385251 0.223898 0.219224 0.193087 -0.277477 0.459371
chargesum: 1.00000
title: Mulliken charges with hydrogens summed into heavy atoms:
elementType: C C C C C C C C O
charge: 0.003067 0.246419 0.052704 0.149937 0.022115 0.124884 -0.031978 0.250958 0.181894
polarizability: 2.10419193e+02 2.08771813e+00 1.44021865e+02 -4.60451659e+00 -4.64935020e+00 6.57047812e+01
1716.lowfreq: -29.5838 0.0003 0.0008 0.0009 16.6184 27.7054 74.2944 123.8303 143.0155
frequency: 73.1694 119.8768 142.6960 221.2685 383.4418 388.6529 401.5340 473.3956 579.5400 600.9068 616.0661 618.7891 673.0513 744.3749 773.1428 857.2445 968.3702 971.6995 997.3308 999.2798 1002.9789 1022.4868 1056.9731 1083.4833 1103.1293 1184.2549 1190.0672 1219.3021 1294.0352 1350.6232 1365.1013 1408.9830 1440.7127 1461.2453 1467.4641 1511.1450 1557.0492 1571.1104 1589.6015 2995.2544 3057.5708 3103.7541 3134.6334 3146.9196 3153.8417 3165.1638 3170.7314 3530.9725
redmass: 2.0838 1.6475 2.6690 3.7520 4.6641 2.8327 3.2254 4.5321 2.7653 3.7047 2.0589 6.0583 1.2777 5.2969 1.5228 1.2651 1.7501 1.7860 1.3810 5.2142 1.2585 2.3643 1.7258 1.5281 1.7062 1.5493 1.0863 1.3618 3.6308 7.6725 1.5544 1.1766 1.5764 1.1454 2.1038 1.9710 4.0237 1.3116 4.5607 1.0389 1.0931 1.1010 1.0877 1.0888 1.0925 1.0958 1.0974 1.0667
irintensity: 4.9036 0.3041 8.1888 6.8183 4.2461 3.4064 7.4718 6.3009 18.5550 47.4196 152.2003 5.6183 27.8380 18.9063 162.9465 0.1295 103.8642 99.7066 0.4642 53.2377 1.3385 5.4185 22.2611 73.0635 32.5830 627.0863 4.3154 131.6529 148.4450 16.1764 136.8302 8.5497 409.9952 95.7780 130.3402 72.6223 2.7809 204.1527 217.6583 29.1127 1.2949 20.6389 1.3945 6.8931 15.1761 15.1317 13.3605 440.7052
temp: 298.150 k
press: 1.00000 atm
elementType: 6 6 6 6 6 6 1 1 1 1 1 6 6 1 1 1 8 1
symmnumber: 1
zpe: 388441.9 jmol-1
zpe.correction: 0.147950 hartree
zpe.thermalcorrener: 0.156080 hartree
zpe.thermalcorrenthalpy: 0.157025 hartree
zpe.thermalcorrgfe: 0.114954 hartree
zpe.sumelectzpe: -385.267126 hartree
zpe.sumelectthermal: -385.258995 hartree
zpe.sumelectthermalent: -385.258051 hartree
zpe.sumelectthermalfe: -385.300122 hartree
dipole: 4.9306 4.8935 -0.1329
dipole: 6.9480
quadrupole: -14.9549 -35.5938 -53.6027
quadrupole: 5.5668 -1.2557 -0.9783
quadrupole: 19.7622 -0.8767 -18.8855 5.5668 -1.2557 -0.9783
hfenergy: -385.4150752 hartree
pointgroup: C01 [X(C8H9O1)]
dipole: 2.2496995 -0.6047963 -0.04048 debye
dipolederiv: -0.5433655 0.4754218 -0.0142803 0.4918815 -0.100961 -0.0186864 -0.0220793 -0.0183842 -0.1642341 0.7458874 -0.2857563 -0.0109255 0.4968382 0.0055789 -0.0231853 -0.0465884 -0.0021773 -0.1111335 -2.1304762 0.0422583 0.0594425 0.1927846 -0.0885653 -0.0023173 0.0648946 0.0042002 0.0060596 0.6775195 0.2697638 -0.0364544 -0.5190779 0.0088526 0.0106409 0.0037693 -0.0134699 -0.0842116 -0.5738767 -0.4583725 0.038348 -0.4604655 -0.0577656 0.0065089 0.0382899 0.0079125 -0.1764709 0.3914816 -0.001316 -0.0157262 0.0084621 0.4129351 -0.0265129 -0.0099348 -0.0265716 -0.0504538 0.0571063 -0.0908517 0.0097351 -0.1197298 -0.0401609 0.017094 0.0104335 0.0159009 0.1890939 0.0956221 0.0941169 -0.0013309 0.0666788 0.006269 0.0077531 0.0010347 0.0065217 0.1853824 0.1157203 -0.0706547 0.0064432 -0.0487424 0.0157423 0.0112277 0.0057044 0.0113632 0.1791252 0.0601425 0.0904658 -0.0010124 0.1180301 -0.0497539 0.0100866 -0.0026562 0.0117628 0.1897279 -0.1007985 0.004561 0.0083856 0.005036 0.1340836 0.0017316 0.0085731 0.001863 0.167297 3.4239124 0.0732289 -0.0877267 0.7090306 1.6144488 -0.1040121 -0.0993998 -0.0776264 0.3080087 -0.1580577 0.1491245 -0.0183888 0.5308377 -0.6456197 0.0305144 -0.1397587 0.0931715 -0.0782874 0.0333149 0.0574703 0.0592872 -0.026848 0.1940551 0.0348657 0.1078522 0.0114319 0.0635414 0.0029004 0.0260994 -0.0731807 -0.0652804 0.1705935 -0.0507267 -0.05977 -0.0689497 0.1059479 -0.0722392 -0.0279455 0.0242734 -0.0755026 0.0633444 0.0152768 0.0482771 -0.0030442 0.161696 -1.6009744 -0.5241734 0.062798 -1.4796531 -1.1405375 0.0883116 0.1007704 0.0564212 -0.383013 0.576181 0.1765593 -0.009687 0.1757201 0.4974606 -0.0085706 -0.009412 -0.0103257 0.4919242 unknown
polarizability: 210.4191927|2.0877181|144.0218647|-4.6045166|-4.6493502|65.7047812 unknown
InChI: InChI=1S/C8H9O/c1-7(9)8-5-3-2-4-6-8/h2-6,9H,1H3
charge 1 multiplicity 1
18 atoms
C  -2.11659313 0.18266065 0.1254672
C  -0.72576192 0.14652081 0.08006362
C  0.01128743 1.35804296 -0.01311922
C  -0.6812774 2.60047152 -0.05957232
C  -2.07049837 2.62035202 -0.01609893
C  -2.78998761 1.41474968 0.0757721
H  -2.67845704 -0.74177888 0.19689916
H  -0.21160003 -0.80663617 0.1181138
H  -0.12300588 3.52610248 -0.13087394
H  -2.59964245 3.56595933 -0.05362735
H  -3.87457924 1.436895 0.10774498
C  1.44652989 1.31957163 -0.061668
C  2.25950243 0.07694199 -0.02734732
H  2.12143692 -0.42664759 0.9380762
H  1.92488081 -0.61968252 -0.80291922
H  3.32116293 0.28778958 -0.16661496
O  2.05278573 2.50206982 -0.13262739
H  3.04009764 2.47048627 -0.17302519
