program: Gaussian 09
title: opt freq
version: AM64L-G09RevB.01
method: RTPSSTPSS
basis: def2TZV
operation: Freq
keyword: #P
keyword: Geom=AllCheck
keyword: Guess=TCheck
keyword: SCRF=Check
keyword: GenChk
keyword: RTPSSTPSS/def2TZV
keyword: Freq
converged: YES YES NO NO
title: Mulliken atomic charges:
elementType: Zr O O O C C C C C H C C C O C C C C C H C H C C H C H C C H C C H C Zr O O C C C C C O C C Zr O O C C C C C O C C C H H C H H C H H H C H H C H H C H H C H H H C H H C H H C H H C H H H H H H H H H H H H H H H H H H H C H H H H H N H H N H H N H H
charge: 1.734551 -1.010376 -1.026264 -0.558175 0.204377 -0.387479 -0.062937 -0.128070 -0.173801 0.176197 -0.079196 -0.103523 -0.224199 -0.507721 0.456435 -0.387115 -0.210330 -0.192514 -0.214295 0.169748 -0.111072 0.175153 -0.228672 -0.084793 0.169657 -0.184342 0.177775 -0.070907 -0.242706 0.187942 -0.027010 -0.256730 0.168825 -0.201409 1.776675 -0.942164 -0.571882 0.164863 -0.372502 -0.070490 -0.098414 -0.232078 -0.534616 0.467304 -0.386545 1.860180 -1.006055 -0.501534 0.059958 -0.153687 0.004929 -0.263358 -0.217814 -0.491254 -0.169300 0.160930 -0.304756 0.120912 0.118751 -0.214902 0.123502 0.124433 -0.421486 0.147566 0.135810 0.135960 -0.266174 0.122196 0.126852 -0.305781 0.122647 0.119604 -0.214781 0.123519 0.123895 -0.421445 0.147699 0.136386 0.136038 -0.251767 0.128705 0.129125 -0.324273 0.123920 0.140738 -0.216583 0.120445 0.122876 -0.428024 0.135189 0.141195 0.145095 0.177555 0.178511 0.179454 0.165990 0.176940 0.208657 0.166895 0.155735 0.209064 0.150902 0.202350 0.155694 0.166003 0.155724 0.161771 0.153580 -0.263817 0.124263 0.126566 0.423437 0.429087 0.215317 -0.386737 0.343506 0.362847 -0.389482 0.342226 0.373039 -0.462189 0.341453 0.342395
chargesum: 0.00000
title: Mulliken charges with hydrogens summed into heavy atoms:
elementType: Zr O O O C C C C C C C C O C C C C C C C C C C C C C C Zr O O C C C C C O C C Zr O O C C C C C O C C C C C C C C C C C C C C N N N
charge: 1.734551 -0.581289 -1.026264 -0.558175 0.204377 -0.387479 0.139413 0.050441 0.002396 -0.079196 0.050058 -0.068506 -0.507721 0.456435 -0.221111 -0.044339 -0.013059 -0.044546 0.064081 -0.051732 0.084864 -0.006568 -0.070907 -0.054764 -0.027010 -0.087905 -0.023854 1.776675 -0.942164 -0.571882 0.164863 -0.372502 0.138167 0.057311 -0.076343 -0.534616 0.467304 -0.219650 1.860180 -0.582618 -0.501534 0.059958 -0.153687 0.213994 -0.101587 -0.066912 -0.491254 0.046017 0.160930 -0.065093 0.033034 -0.002150 -0.017127 -0.063530 0.032634 -0.001322 0.006063 -0.059615 0.026739 -0.006544 -0.012988 0.319615 0.325783 0.221659
polarizability: 1.14301207e+03 1.40250795e+01 1.15849813e+03 1.52111376e+01 -1.19377053e+01 1.16479234e+03
temp: 298.150 k
press: 1.00000 atm
elementType: 40 8 8 8 6 6 6 6 6 1 6 6 6 8 6 6 6 6 6 1 6 1 6 6 1 6 1 6 6 1 6 6 1 6 40 8 8 6 6 6 6 6 8 6 6 40 8 8 6 6 6 6 6 8 6 6 6 1 1 6 1 1 6 1 1 1 6 1 1 6 1 1 6 1 1 6 1 1 1 6 1 1 6 1 1 6 1 1 6 1 1 1 1 1 1 1 1 1 1 1 1 1 1 1 1 1 1 1 6 1 1 1 1 1 7 1 1 7 1 1 7 1 1
symmnumber: 1
zpe: 2517212.5 jmol-1
zpe.correction: 0.958756 hartree
zpe.thermalcorrener: 1.027775 hartree
zpe.thermalcorrenthalpy: 1.028719 hartree
zpe.thermalcorrgfe: 0.852234 hartree
zpe.sumelectzpe: -2923.076968 hartree
zpe.sumelectthermal: -2923.007949 hartree
zpe.sumelectthermalent: -2923.007005 hartree
zpe.sumelectthermalfe: -2923.183490 hartree
dipole: 1.4489 -8.4666 -0.1805
dipole: 8.5916
quadrupole: -386.3332 -644.7614 -417.0225
quadrupole: -40.3513 14.0259 -109.3093
quadrupole: 96.3725 -162.0557 65.6832 -40.3513 14.0259 -109.3093
hfenergy: -2924.0357239 hartree
pointgroup: C01 [X(C48H59N3O10Zr3)]
dipole: 0.5700495 -3.3310361 -0.0710142 debye
polarizability: 1143.0120682|14.0250795|1158.4981261|15.2111376|-11.9377053|1164.7923378 unknown
InChI: InChI=1S/3C9H13.3C7H6NO2.2HO.2O.3Zr/c3*1-2-3-6-9-7-4-5-8-9;8-6-3-1-2-5(4-6)7(9)10;2*8-6-4-2-1-3-5(6)7(9)10;;;;;;;/h3*4-5,7-8H,2-3,6H2,1H3;3*1-4H,8H2;2*1H;;;;;/q;;;3*-2;;;;;3*+2
charge 0 multiplicity 1
123 atoms
Zr 6.28459004 14.4706867 14.46619183
O  4.75775227 13.50621175 15.75487151
O  5.1337759 13.11061888 13.24413964
O  7.50967935 14.71026595 12.54528606
C  7.17411227 14.59474192 11.27974392
C  8.23845777 14.53479957 10.26157623
C  7.86402783 14.44355635 8.89782226
C  6.62076627 15.73915512 16.86766309
C  8.56576967 15.42479455 15.68122122
H  9.51281352 15.02244934 15.34100822
C  7.80167608 14.92722955 16.78436343
C  10.1762 14.3908 8.2123
C  8.80437333 14.37292742 7.87737004
O  5.92648667 14.54342925 10.89644415
C  9.63606667 14.56074477 10.596513
C  10.58259714 14.48011553 9.53478882
C  6.67642501 16.74316188 15.85326407
C  7.87929723 16.54504568 15.11344815
C  2.46664437 11.58766712 16.71496333
H  2.58948118 12.39239393 17.42845288
C  2.75135039 9.61052687 15.55673493
H  3.15743115 8.66461343 15.21800185
C  3.29538592 10.43120991 16.5928661
C  2.68885676 16.89809483 11.7852157
H  2.82661204 17.60831918 12.59066652
C  2.97848975 15.72473443 9.82678588
H  3.37256319 15.3941662 8.8728365
C  3.49482195 16.81443277 10.60708937
C  1.41535603 11.47322614 15.75193914
H  0.62362432 12.19630209 15.60328935
C  1.57678783 10.24498632 15.03683396
C  1.68139833 15.88659945 11.72929464
H  0.90909329 15.71486949 12.46797583
C  1.85365013 15.16925682 10.50510406
Zr 3.95400454 14.49544359 12.10489685
O  4.94252063 15.68413704 13.48219377
O  3.61917229 12.51721945 10.95003802
C  3.6690465 11.24114356 11.25351758
C  3.7791913 10.23731958 10.18006586
C  3.85889039 8.86624304 10.53452787
C  3.9977 8.2123 8.2123
C  3.96679783 7.86056983 9.58114503
O  3.59783811 10.82847189 12.49984339
C  3.80947584 10.59058661 8.78651702
C  3.9214076 9.54242213 7.82607178
Zr 3.90051371 11.94870989 14.44811511
O  2.61858782 13.55204829 13.62158381
O  5.84739213 10.80960181 14.7512711
C  7.09486744 11.19749099 14.63964464
C  8.16289487 10.15823643 14.54955439
C  9.51380076 10.5548664 14.46287886
C  10.1762 8.2123 14.3908
C  10.50596215 9.56995466 14.38511027
O  7.45048698 12.44513361 14.62291175
C  7.81926736 8.79743566 14.55640856
C  8.82075375 7.8009989 14.47693248
C  4.15638565 18.9479919 9.36741
H  3.68364301 18.57373195 8.44840611
H  3.38586262 19.50518344 9.91860096
C  5.31159429 19.90097682 8.99843141
H  6.08513963 19.33920713 8.45580222
H  5.7806339 20.27342168 9.92016457
C  4.84756687 21.09374114 8.14062839
H  5.68546699 21.75858967 7.89688402
H  4.40616132 20.75083355 7.19627282
H  4.09070529 21.68742758 8.66875115
C  8.19215231 13.81261408 17.72716413
H  7.29001665 13.3333887 18.13057895
H  8.74996061 13.03918247 17.18352072
C  9.06188282 14.30452375 18.9164679
H  9.97527473 14.77285318 18.52376332
H  8.51477961 15.08337282 19.4659817
C  9.44393376 13.16664964 19.88495737
H  8.52758219 12.7013053 20.27527268
H  9.98292234 12.38526586 19.33061938
C  10.31286249 13.65298099 21.06056182
H  10.56598821 12.82691016 21.73656142
H  11.25226338 14.09102058 20.70037035
H  9.78894605 14.4182553 21.64715069
C  0.65712462 9.67143305 13.97846595
H  1.23115925 8.99370369 13.33300978
H  -0.10687674 9.04714322 14.46978337
C  -0.06765007 10.71602893 13.0991826
H  -0.65876045 11.38823081 13.73614658
H  0.67741481 11.33654225 12.58277076
C  -0.99952485 10.06563124 12.05514563
H  -0.41477961 9.37757983 11.42820594
H  -1.75393573 9.45685166 12.57334547
C  -1.70430313 11.09905427 11.15613372
H  -2.32435047 11.78251857 11.75006907
H  -0.9732954 11.70273755 10.60304519
H  -2.35585767 10.60774395 10.42296277
H  1.24964886 14.33813573 10.16342246
H  5.82986925 15.6234317 17.59915826
H  8.21409719 17.13576758 14.2705843
H  5.93277941 17.50743923 15.67105927
H  4.1654946 10.2022873 17.19517223
H  3.83788154 8.61319036 11.58906775
H  3.94559695 9.81197877 6.77360489
H  4.02751275 6.82031878 9.88373022
H  9.77261807 11.60666113 14.45642844
H  11.550546 9.86073738 14.31810028
H  6.80510073 14.42675206 8.66362367
H  8.49057605 14.30468386 6.84095361
H  11.63983872 14.49367242 9.78563089
H  4.08212635 7.4395102 7.45333289
H  10.95685325 7.45875114 14.33024442
H  10.9264958 14.33373154 7.42823173
C  4.62549741 17.74181455 10.22627391
H  5.39018924 17.18972398 9.66438469
H  5.10956735 18.12564364 11.13385341
H  1.64220506 13.52924221 13.58333415
H  4.74716676 13.5002011 16.73188193
H  6.7760151 8.50553297 14.62218039
N  3.73157523 11.88753793 8.34939092
H  3.76461223 12.09757257 7.36055441
H  3.67328944 12.63347543 9.03511965
N  10.09209302 14.65697774 11.88632193
H  11.084991 14.65980511 12.0787327
H  9.4167512 14.70923652 12.64174155
N  8.48634158 6.45740015 14.49185081
H  9.19643246 5.74536287 14.39267197
H  7.5196052 6.16359193 14.50594469
