program: Gaussian 09
title: 000049945
version: EM64L-G09RevD.01
frameworkgroup: C1[X(C12H16Cl2N2O3)]
method: RPBEPBE
basis: SDD
operation: Freq
keyword: #p
keyword: freq=noraman
keyword: PBEPBE/SDD
title: #p freq=noraman PBEPBE/SDD
converged: YES YES NO NO
title: Mulliken charges:
elementType: Cl Cl O O O N N C C C C C C C C C C C C H H H H H H H H H H H H H H H H
charge: -0.022106 -0.046317 -0.460609 -0.443147 -0.225306 -0.077382 -0.457780 -0.369113 -0.375054 -0.535825 -0.305753 -0.325418 0.235920 0.667840 -0.242530 -0.284653 -0.237775 -0.233905 -0.214529 0.224293 0.217844 0.181950 0.226406 0.247849 0.228650 0.207989 0.209799 0.238864 0.212598 0.315696 0.344083 0.329985 0.261700 0.262145 0.243587
chargesum: 0.00000
title: Mulliken charges with hydrogens summed into heavy atoms:
elementType: Cl Cl O O O N N C C C C C C C C C C C C
charge: -0.022106 -0.046317 -0.116525 -0.113162 -0.225306 -0.077382 -0.142084 0.073024 0.033302 -0.059326 0.112034 0.126045 0.235920 0.667840 -0.242530 -0.284653 0.023925 0.028241 0.029058
polarizability: 2.16885701e+02 -1.06617247e+01 1.85800311e+02 1.91711332e+01 1.68000230e+01 1.24958874e+02
1716.lowfreq: -8.4526 -4.1686 -1.3892 -0.0027 -0.0009 0.0004 12.5393 23.7572 42.0505
frequency: 7.7031 23.5814 42.0223 51.8469 54.8308 64.8708 70.8185 85.9694 99.6618 109.0363 137.3718 165.5709 195.5491 208.3871 232.6809 239.9015 257.4332 270.3944 283.2160 294.2850 316.6082 328.7822 367.1722 380.8465 395.9965 467.9162 478.4940 493.6592 511.7490 512.1632 534.7120 572.5407 612.5097 677.5348 719.0649 739.2600 771.7228 789.3462 805.5420 820.8921 887.0588 893.4985 908.5404 951.8830 953.4860 965.7078 972.5429 989.0976 1018.2997 1041.5789 1050.9178 1067.7066 1080.2957 1129.0638 1142.9961 1157.0899 1165.9633 1195.2650 1199.2244 1204.1012 1265.1287 1275.6515 1287.4302 1291.3722 1321.4961 1337.1451 1350.0023 1357.0948 1366.6180 1374.2990 1383.8589 1409.8065 1413.6267 1420.3480 1448.4315 1450.1802 1455.8743 1465.7547 1476.8043 1480.9435 1565.2343 1591.5895 1648.2156 2912.3032 2947.9404 2961.6268 2970.9988 2984.0138 3005.3248 3013.4331 3020.9956 3051.2294 3094.5659 3155.9878 3175.2993 3186.4920 3503.5529 3561.8779 3577.9755
redmass: 8.1324 6.1954 5.4058 5.2614 5.4472 4.4612 2.8375 2.6695 3.2799 4.1113 6.8493 9.8890 4.7933 6.2362 3.2734 6.8344 5.3497 1.1024 1.3432 5.5444 3.1160 2.5578 6.8195 6.9919 6.3416 3.1426 3.1284 3.2749 2.2151 5.1036 1.9997 4.5146 6.4628 4.9373 4.8815 7.6261 1.3682 1.1616 1.1826 4.8387 4.2584 1.3556 7.2859 3.1588 3.9791 1.3325 4.6946 2.9398 3.8441 1.5232 4.5205 2.8105 1.7817 1.8971 1.8754 1.3741 1.4486 1.4804 1.3056 1.2382 2.2364 1.4909 1.1580 1.2173 1.3594 1.3330 1.2549 6.2376 1.5403 1.5060 1.4895 1.3652 2.2506 1.1087 1.0764 2.9316 1.0897 2.0700 1.0959 1.0828 6.1772 8.0626 7.0451 1.0614 1.0586 1.0626 1.0566 1.0965 1.0901 1.0744 1.1006 1.1052 1.1056 1.0874 1.0930 1.0997 1.0759 1.0663 1.0667
irintensity: 0.0050 0.2006 0.2531 1.0411 2.4330 8.3257 5.1895 0.3527 0.9525 12.7966 1.6039 1.0822 0.7757 8.9167 0.4504 2.6329 5.3240 156.7545 73.3605 24.3709 63.1434 6.6569 8.0683 6.4126 14.5765 10.2020 8.6164 2.5316 31.2727 0.6733 49.9557 6.4711 1.2835 17.0938 23.8438 87.8589 64.7541 5.9005 7.5425 3.0695 18.1038 0.0844 4.6922 147.6217 70.0012 0.7185 53.3193 5.6409 13.2292 17.8340 9.5587 8.3721 35.2592 123.6138 13.5558 7.1706 19.7531 16.2415 14.5797 41.9150 45.3077 11.1536 5.5041 8.8029 59.2176 13.1919 15.3150 35.4093 2.1628 28.9222 26.9781 3.8472 80.6973 15.0476 11.5578 49.0046 15.0456 328.8875 2.1342 6.7847 29.3972 11.6607 124.5327 58.4876 62.9951 25.6517 86.7093 13.2923 21.5893 40.7341 16.1260 71.0195 37.6121 2.8781 0.7713 5.5651 22.0180 7.3553 4.4255
temp: 298.150 k
press: 1.00000 atm
elementType: 17 17 8 8 8 7 7 6 6 6 6 6 6 6 6 6 6 6 6 1 1 1 1 1 1 1 1 1 1 1 1 1 1 1 1
symmnumber: 1
zpe: 704160.7 jmol-1
zpe.correction: 0.268201 hartree
zpe.thermalcorrener: 0.289308 hartree
zpe.thermalcorrenthalpy: 0.290252 hartree
zpe.thermalcorrgfe: 0.214240 hartree
zpe.sumelectzpe: -1720.677309 hartree
zpe.sumelectthermal: -1720.656202 hartree
zpe.sumelectthermalent: -1720.655258 hartree
zpe.sumelectthermalfe: -1720.731270 hartree
dipole: 5.5197 -0.2809 -1.7624
dipole: 5.8010
quadrupole: -131.2214 -120.9708 -128.0627
quadrupole: -0.3379 8.7811 9.5005
quadrupole: -4.4698 5.7808 -1.3111 -0.3379 8.7811 9.5005
hfenergy: -1720.9455095 hartree
pointgroup: C01 [X(C12H16Cl2N2O3)]
dipole: -2.1515317 -0.3111399 0.6949541 debye
polarizability: 211.1914374|20.1344726|181.9234717|20.9724125|-24.6577411|134.5299769 unknown
InChI: InChI=1S/C12H16Cl2N2O3/c13-9-2-1-3-10(14)12(9)15-11(19)8-16(4-6-17)5-7-18/h1-3,15,17-18H,4-8H2
charge 0 multiplicity 1
35 atoms
Cl -1.604885 2.400876 -0.477936
Cl -2.507727 -2.74999 1.499177
O  3.756072 3.455504 -0.242736
O  4.306914 -2.525425 -1.273052
O  0.559345 0.091777 -0.697631
N  2.857493 0.077674 1.138532
N  -0.908375 -0.192293 1.105207
C  3.460533 1.401857 0.955392
C  3.551745 -1.113159 0.635358
C  1.501428 -0.019794 1.616185
C  2.985413 2.197822 -0.281573
C  3.545745 -1.3152 -0.905997
C  0.369966 -0.032977 0.538978
C  -2.115963 -0.228532 0.359628
C  -2.543721 0.849608 -0.461693
C  -2.981119 -1.354296 0.42031
C  -3.722229 0.783503 -1.228795
C  -4.179397 -1.440766 -0.307208
C  -4.538089 -0.366078 -1.151714
H  4.557933 1.281053 0.88156
H  3.266496 2.030833 1.849247
H  3.091885 -2.006601 1.109304
H  4.612005 -1.090634 0.961679
H  1.289874 0.838352 2.289343
H  1.376384 -0.939639 2.231715
H  3.184161 1.629467 -1.211865
H  1.896049 2.395006 -0.226663
H  2.510204 -1.339131 -1.295229
H  4.087979 -0.494092 -1.402467
H  -0.956284 -0.499628 2.081201
H  3.483404 4.031193 -0.999736
H  3.796444 -3.324209 -0.986163
H  -4.005443 1.63104 -1.858527
H  -4.807846 -2.331347 -0.226136
H  -5.458793 -0.420774 -1.740195
