program: Gaussian 09
title: 000049997
version: EM64L-G09RevD.01
frameworkgroup: C1[X(C22H23NO3)]
method: RPBEPBE
basis: SDD
operation: Freq
keyword: #p
keyword: freq=noraman
keyword: PBEPBE/SDD
title: #p freq=noraman PBEPBE/SDD
converged: YES YES NO NO
title: Mulliken charges:
elementType: O O O N C C C C C C C C C C C C C C C C C C C C C C H H H H H H H H H H H H H H H H H H H H H H H
charge: -0.278545 -0.279459 -0.311861 0.003375 0.284528 0.283165 -0.457555 -0.738284 -0.728864 -0.737428 -0.726969 0.305328 -0.189696 0.538935 -0.193539 -0.529774 -0.439332 0.348058 -0.200190 -0.392544 0.349846 -0.356221 -0.383402 -0.204292 -0.192559 -0.247202 0.263996 0.210017 0.211371 0.256509 0.222048 0.218092 0.212822 0.209613 0.256494 0.213056 0.217660 0.224186 0.212257 0.283530 0.287050 0.266147 0.233565 0.262704 0.264442 0.257885 0.228926 0.230997 0.231115
chargesum: 0.00000
title: Mulliken charges with hydrogens summed into heavy atoms:
elementType: O O O N C C C C C C C C C C C C C C C C C C C C C C
charge: -0.278545 -0.279459 -0.311861 0.003375 0.284528 0.283165 -0.193559 -0.060388 -0.075902 -0.058264 -0.072866 0.305328 0.093834 0.538935 -0.193539 -0.242724 -0.173185 0.348058 0.033375 -0.129839 0.349846 -0.091779 -0.125517 0.024633 0.038438 -0.016087
polarizability: 3.18653499e+02 1.78970136e+01 2.49945388e+02 1.60916416e+01 2.17038647e+01 2.01506625e+02
1716.lowfreq: -5.3006 -0.0003 0.0005 0.0006 1.6253 4.2878 6.6893 15.8336 24.4044
frequency: 5.5541 15.6555 24.1983 27.1919 41.8244 57.5524 61.8479 86.1524 95.7302 128.0466 134.6703 145.7617 149.6501 171.7462 181.1044 187.0068 198.2170 211.4221 220.4852 236.8117 260.3872 281.2473 302.6352 319.4574 327.0594 355.1588 370.9866 373.1510 378.7030 409.5052 412.6694 430.5324 433.9449 453.7678 480.1191 488.2158 544.1268 562.4312 583.4990 608.9645 610.0289 619.9836 639.7579 648.0551 690.8827 696.4607 699.2759 735.6793 741.9588 764.5264 799.2761 811.8895 824.5609 834.7043 858.0110 900.1603 913.7956 915.6526 916.8628 936.4128 946.5371 956.8673 963.2678 965.6092 968.6038 984.1778 986.1173 987.0088 988.7531 994.3972 998.6361 1017.0380 1019.9210 1026.4067 1077.5933 1087.0794 1103.2786 1115.3685 1125.7349 1140.4082 1167.9952 1173.0718 1176.3207 1183.1690 1186.1148 1195.5476 1236.0246 1270.6894 1280.7022 1282.9624 1308.0146 1326.1582 1328.7126 1381.6705 1381.9000 1391.9420 1393.3523 1395.7531 1397.8089 1417.4350 1439.7673 1445.6648 1454.6617 1461.6246 1466.4624 1467.9765 1470.8173 1478.2083 1483.6716 1484.9209 1495.3823 1508.3843 1594.6309 1595.6517 1606.0616 1613.5899 1621.7377 2204.7791 2975.8055 2978.7874 2980.1685 2984.7408 3008.0914 3057.6749 3060.7071 3062.9606 3065.5949 3086.3703 3097.0688 3110.7834 3121.4329 3132.7660 3139.7792 3141.0557 3142.0576 3151.6904 3156.9200 3157.2606 3166.2024 3175.2415 3176.2013
redmass: 4.9142 4.1040 5.5270 4.0668 4.7017 5.2326 5.8629 5.3938 9.3109 1.2125 2.2079 1.7733 2.2896 2.1960 1.9173 2.2798 2.0341 2.3941 3.8282 3.6758 2.5551 3.6238 5.2951 3.0895 5.9329 4.9157 2.5294 2.5004 5.0804 2.9306 3.5340 2.9365 5.1704 3.4793 3.3326 2.9222 7.2376 7.7207 5.6808 3.7131 6.2206 6.4212 6.2697 3.2503 2.4724 3.5411 3.2114 4.4047 4.9279 1.7483 2.6033 2.1300 5.4649 1.3074 4.4245 1.5081 1.4273 2.3264 1.5231 3.2053 1.3421 3.5605 1.3484 1.6689 1.3686 1.5203 3.7760 3.3982 1.5365 3.5665 1.4137 1.7611 2.0828 1.2471 1.5103 1.6035 2.1911 1.8093 1.8096 1.9497 1.1728 1.1579 1.1336 2.2732 4.0849 2.2744 2.5904 1.2361 1.6173 3.5593 1.3506 1.4733 1.8649 6.4551 1.3192 7.7535 1.2609 1.2189 1.7749 1.4924 2.3723 2.5837 1.0523 1.0475 1.0522 1.0472 2.2883 2.5415 1.0490 1.0483 1.1792 1.0683 6.3789 6.4920 6.5407 6.5248 9.1255 12.5937 1.0370 1.0380 1.0382 1.0387 1.0822 1.0990 1.0989 1.0983 1.0981 1.0991 1.0964 1.0975 1.0952 1.0850 1.0875 1.0886 1.0891 1.0920 1.0933 1.0934 1.0967 1.0983 1.1003
irintensity: 0.1656 0.2042 0.2739 0.6903 1.5030 2.5806 0.3639 1.4802 1.6315 0.1919 0.3032 0.5626 1.2114 0.6631 0.7876 0.7045 1.8501 3.1445 1.7992 3.7891 6.3575 6.3882 1.3749 2.4687 3.2729 3.2472 0.1807 0.1320 4.7933 0.6452 3.5071 0.4682 1.6496 5.4193 20.1422 6.3026 3.8124 0.3506 2.4665 0.5346 4.1309 3.8581 11.0623 15.2569 37.5550 13.7353 13.9284 2.5579 5.7874 101.2847 179.0815 13.0185 65.0873 3.4306 6.1887 7.2925 5.1897 5.7814 1.6753 96.8013 1.6822 51.7743 6.1788 52.2769 0.1208 1.2616 31.4910 0.2047 0.8534 119.9225 18.7557 104.8002 11.1184 3.5818 8.5489 18.7040 262.0092 2.3961 60.3677 6.7664 35.4941 38.2784 1.5484 21.4623 80.4140 138.5322 216.0891 8.2775 71.1968 2.3495 0.9780 17.5433 66.8212 6.7898 0.4760 7.3042 50.1921 19.6218 111.0946 45.2169 15.8596 57.8744 0.3690 0.3749 23.3278 14.6000 158.6972 20.8675 5.7345 13.4882 20.5463 16.7907 8.4779 150.2181 40.6722 8.4329 125.9679 2.7727 10.4279 41.1065 54.2889 52.0586 29.0209 5.2832 2.4893 28.1020 74.1089 31.1624 30.9478 8.7054 7.5892 1.4435 5.3581 3.6149 9.4574 6.1286 8.1427 21.6619 14.0855 9.4407 6.7166
temp: 298.150 k
press: 1.00000 atm
elementType: 8 8 8 7 6 6 6 6 6 6 6 6 6 6 6 6 6 6 6 6 6 6 6 6 6 6 1 1 1 1 1 1 1 1 1 1 1 1 1 1 1 1 1 1 1 1 1 1 1
symmnumber: 1
zpe: 1026794.5 jmol-1
zpe.correction: 0.391085 hartree
zpe.thermalcorrener: 0.416989 hartree
zpe.thermalcorrenthalpy: 0.417934 hartree
zpe.thermalcorrgfe: 0.331298 hartree
zpe.sumelectzpe: -1130.635065 hartree
zpe.sumelectthermal: -1130.609161 hartree
zpe.sumelectthermalent: -1130.608217 hartree
zpe.sumelectthermalfe: -1130.694853 hartree
dipole: -2.3832 1.1730 -3.7793
dipole: 4.6193
quadrupole: -135.4658 -142.5658 -166.5610
quadrupole: -2.3407 2.7521 -0.1204
quadrupole: 12.7317 5.6318 -18.3635 -2.3407 2.7521 -0.1204
hfenergy: -1131.0261508 hartree
pointgroup: C01 [X(C22H23N1O3)]
dipole: -1.1145113 -0.3426103 1.3940578 debye
polarizability: 318.9853211|-23.0977811|253.658619|-0.7721593|16.8027226|197.4615723 unknown
InChI: InChI=1S/C22H23NO3/c1-21(2)19(22(21,3)4)20(24)26-18(14-23)15-9-8-12-17(13-15)25-16-10-6-5-7-11-16/h5-13,18-19H,1-4H3
charge 0 multiplicity 1
49 atoms
O  -0.98165 -0.387843 -1.108058
O  -2.644491 1.259692 -1.205051
O  4.115545 0.686905 1.164624
N  1.292326 -0.680671 -3.622591
C  -4.244909 -0.718507 0.767414
C  -4.639143 -1.206973 -0.63578
C  -3.115949 -0.988574 -0.297088
C  -4.556355 0.718039 1.191587
C  -4.264585 -1.681611 1.958242
C  -5.341339 -0.255874 -1.606767
C  -5.056794 -2.663367 -0.861156
C  -2.30783 0.08695 -0.896859
C  -0.029788 0.620901 -1.71065
C  0.854608 1.21585 -0.624089
C  0.703026 -0.104772 -2.761197
C  2.079774 0.608084 -0.262948
C  0.408024 2.383933 0.042432
C  2.845841 1.173185 0.780884
C  1.193851 2.940422 1.075638
C  2.413259 2.339774 1.451681
C  4.463757 -0.68356 1.009242
C  3.566434 -1.734963 1.30765
C  5.801483 -0.943405 0.64349
C  4.024746 -3.068313 1.219165
C  6.246213 -2.28153 0.565132
C  5.360716 -3.348099 0.847603
H  -2.539847 -1.905609 -0.140618
H  -5.609803 0.789335 1.523166
H  -3.914746 1.008373 2.044615
H  -4.391692 1.451541 0.3885
H  -3.56545 -1.331234 2.740017
H  -5.277211 -1.718307 2.403943
H  -3.976528 -2.711515 1.690529
H  -6.422581 -0.215695 -1.374336
H  -4.938287 0.767328 -1.578204
H  -5.234269 -0.626459 -2.643338
H  -6.138623 -2.785911 -0.66106
H  -4.874299 -2.951032 -1.91306
H  -4.512063 -3.377594 -0.221794
H  -0.652542 1.414982 -2.168162
H  2.437444 -0.278964 -0.796021
H  -0.545088 2.841615 -0.243306
H  0.857118 3.846242 1.590361
H  3.040349 2.756293 2.245367
H  2.53723 -1.518586 1.610937
H  6.467492 -0.102342 0.429388
H  3.335167 -3.888271 1.447891
H  7.283055 -2.489095 0.279177
H  5.707606 -4.38457 0.781157
