program: Gaussian 09
title: py-SiMe2Ph-HSi-ts. From converged point at 1.66SiH.
version: ES64L-G09RevE.01
frameworkgroup: C1[X(C51H51FeN5Si)]
method: RwB97XD
basis: Gen
operation: Freq
keyword: #P
keyword: Geom=AllCheck
keyword: Guess=TCheck
keyword: SCRF=Check
keyword: GenChk
keyword: RwB97XD/ChkBas
keyword: Freq
converged: YES YES YES YES
title: Mulliken charges:
elementType: Fe Si N N N N N C C C C C C C C C C C H C H C C C C H C H C H C H C C C C H C H C C H C H C H C H C C H C H H H C H H H C H C H H H C H H H C H C H C H C H C H C H H H C H H H C H C H C H H H C H H H C H C H C H C H H H
charge: -1.254338 1.004484 -0.490434 -0.710699 -0.516531 -0.687932 -0.120375 -0.236008 0.245703 0.444471 0.214161 0.139032 0.140054 0.111178 0.271615 0.271439 0.107526 -0.235582 0.135071 -0.233583 0.134786 0.106098 0.234911 0.120281 -0.145970 0.135823 -0.155948 0.167030 -0.157530 0.168146 -0.238763 0.130978 0.452883 0.121098 0.108606 0.058126 0.169708 -0.169130 0.152084 0.228554 -0.153195 0.136495 -0.170556 0.152635 -0.240250 0.130356 -0.164363 0.176675 -0.086812 0.094749 0.188285 -0.616531 0.134418 0.133965 0.131708 -0.606348 0.156840 0.135306 0.143606 -0.203227 0.138231 -0.419403 0.158503 0.137858 0.170603 -0.416283 0.158878 0.171582 0.136347 -0.166417 0.175340 -0.171728 0.150814 -0.170101 0.150397 -0.149236 0.168644 -0.136966 0.171066 -0.437116 0.160490 0.142717 0.144993 -0.420940 0.161034 0.167440 0.140436 -0.146092 0.129044 -0.155667 0.171131 -0.417044 0.165934 0.159510 0.140203 -0.436138 0.154828 0.141507 0.150477 -0.137997 0.118582 -0.141983 0.139799 -0.156474 0.139369 -0.146592 0.137557 -0.077086 0.055171
chargesum: -0.00000
title: Mulliken charges with hydrogens summed into heavy atoms:
elementType: Fe Si N N N N N C C C C C C C C C C C C C C C C C C C C C C C C C C C C C C C C C C C C C C C C C C C C C C C C C C C
charge: -1.276253 1.004484 -0.490434 -0.710699 -0.516531 -0.687932 -0.120375 -0.236008 0.245703 0.444471 0.214161 0.139032 0.140054 0.111178 0.271615 0.271439 0.107526 -0.100512 -0.098797 0.106098 0.234911 0.120281 -0.010147 0.011082 0.010616 -0.107784 0.452883 0.121098 0.108606 0.227834 -0.017046 0.228554 -0.016700 -0.017921 -0.109894 0.012312 -0.086812 0.283034 -0.216440 -0.170595 -0.064996 0.047560 0.050523 0.008922 -0.020914 -0.019704 0.019408 0.034100 0.011084 0.047970 -0.017047 0.015464 0.048603 0.010674 -0.019415 -0.002184 -0.017105 -0.009035
chargesum: 0.00000
polarizability: 9.16476058e+02 3.03669169e+01 9.48955022e+02 2.44475335e+01 9.22794504e+01 7.00317109e+02
1716.lowfreq: -141.3844 -8.9197 -4.8211 0.0008 0.0012 0.0014 7.5448 16.0482 25.3825
redmass: 3.7062 4.7753 4.5865 5.0981 4.9767 4.4251 5.0276 4.9502 4.7532 4.7764 4.2494 4.2995 4.0991 3.9726 4.3979 4.1367 4.2978 3.8665 4.2529 4.3753 1.2069 1.0274 2.6484 2.5256 1.4407 3.3250 2.4412 3.3846 2.7389 1.3355 2.6230 2.9643 2.3543 3.2698 2.2699 1.9870 1.8869 1.9800 2.7730 4.0995 2.2073 3.8958 2.8144 2.9734 2.6992 2.9968 4.1372 3.0284 2.1544 2.5569 2.4949 4.1267 2.9943 2.2326 3.7541 3.6370 3.2421 3.6567 5.2022 5.9135 4.6501 5.5247 5.1443 5.2530 2.6060 3.8798 3.6912 3.9375 2.6408 6.4153 3.4891 5.0133 3.5008 2.2000 2.4598 3.6910 3.7351 3.0998 3.1208 3.6676 4.4262 4.1781 4.0167 4.1761 4.8368 4.6202 4.2091 4.1716 4.3635 5.1888 5.0098 4.4964 3.3279 6.1570 5.4800 6.8099 5.0059 4.6268 5.9788 2.5875 4.1923 5.5827 3.4825 1.7761 2.5566 2.1617 1.6440 3.8498 4.6744 1.4743 1.6251 3.8072 2.3073 1.6674 1.7725 2.9720 2.3179 1.6650 2.4995 2.8577 1.7642 1.9683 3.5768 4.6756 5.4708 1.5275 1.3485 1.4744 1.2618 1.4171 1.3048 1.3032 1.4306 1.2629 1.2988 1.2939 2.8794 1.3467 1.6759 1.5462 1.3681 2.6930 1.3253 2.2632 2.2582 1.3790 3.3978 4.5703 1.2806 1.4048 1.2784 7.4375 1.4520 1.2899 5.8309 1.3244 1.6454 1.6043 1.4822 1.4800 7.1056 2.1349 2.0372 3.1392 3.9502 1.6938 4.4821 1.5837 1.6093 1.8103 1.8033 1.5809 1.5243 1.4969 5.1505 1.6130 1.6420 1.6505 1.8008 2.7622 1.9136 1.4357 1.1028 1.2134 1.1075 1.8705 1.2166 1.6508 1.2938 1.8914 1.1387 2.8552 2.2070 3.3496 1.2060 2.9962 3.3606 1.3930 1.3627 1.2572 1.2322 7.6473 3.6603 2.6533 3.0645 5.0845 5.5109 3.6646 3.9332 2.1071 3.9870 1.5421 7.7836 1.1989 7.1946 5.0038 2.5930 1.8960 1.3115 1.3613 1.6199 1.3495 1.4688 3.0132 1.5858 4.3057 1.6763 1.7555 1.0960 1.0770 1.0577 1.1244 1.9390 1.1141 1.0605 1.0821 1.0567 1.1564 1.6941 1.7257 1.6621 1.0912 1.3004 1.1004 1.2023 1.6188 1.7343 2.0811 2.8506 2.3222 2.7539 2.1277 3.3032 3.0543 3.6579 4.1517 5.3488 2.3101 6.6242 7.6202 1.6417 5.7307 6.7255 5.6459 7.5183 7.6375 5.6088 6.6855 6.6339 7.4226 7.3837 1.0193 1.0375 1.0383 1.0389 1.0380 1.0384 1.0411 1.0396 1.0385 1.1000 1.1011 1.1006 1.0990 1.0996 1.0961 1.1000 1.1007 1.1003 1.1037 1.1037 1.1025 1.1001 1.1032 1.1016 1.0988 1.0860 1.0915 1.0883 1.0915 1.0914 1.0917 1.0895 1.0910 1.0884 1.0943 1.0874 1.0894 1.0971 1.0912 1.0919 1.0917 1.0973 1.0974 1.0933 1.0945 1.0949 1.0970 1.0928 1.0922 1.0942
irintensity: 400.5935 0.0619 0.0366 0.8113 0.3702 0.6392 0.7941 0.2472 3.3084 1.6351 0.6147 0.7179 0.5273 0.2362 0.3883 5.3116 5.3211 3.7293 5.7971 0.1371 1.0928 0.1586 0.3547 0.9945 4.1587 0.6348 1.5704 0.8183 0.0039 7.0147 3.0464 1.1691 1.2641 4.5986 12.9073 3.5848 3.9931 2.0823 6.4443 0.0602 3.6609 24.5702 2.3731 21.2999 26.7585 0.9532 1.1696 11.5210 3.4857 4.4416 1.0491 16.1374 48.9060 1.0212 15.9922 9.1472 0.3479 18.6775 30.4634 5.1146 78.2488 37.4275 14.3331 5.6652 0.3419 0.7487 3.1760 11.8978 5.0022 15.6134 28.6745 8.0217 4.0841 33.3422 37.2173 1.5250 1.8078 1.3387 0.2377 11.2401 1.1133 0.8552 1.7601 12.5131 7.4109 3.3886 0.6169 0.2306 7.7973 7.5954 81.1987 13.9351 100.9051 0.5739 1.2322 3.3575 4.2484 3.0083 3.6393 82.6574 3.8693 0.2013 34.3482 50.2426 49.9428 79.8464 35.8939 10.2477 7.9384 70.7542 67.7366 4.8757 21.5726 112.8970 62.3901 54.7196 17.7110 10.6112 30.7531 20.8437 44.2490 293.4080 19.6854 12.2689 6.8080 94.1643 106.4515 2.9002 1.0825 0.0441 28.0095 8.8826 0.1812 0.3313 1.7738 2.2821 2.3569 50.3457 43.8150 85.6127 7.3407 27.8227 19.4374 3.4130 10.3263 0.7574 2.6643 0.4649 0.2938 0.6412 0.1047 14.4389 0.0441 0.4245 0.1833 0.0837 12.4321 21.3800 2.0103 1.7204 2.4674 4.4489 28.3732 1.4484 1.9639 11.4658 4.8143 15.4983 10.8817 4.0536 3.7343 13.6997 10.5087 1.8589 2.4822 15.2413 3.1255 5.3162 17.5349 39.0032 3.3306 1.4016 4.6245 7.1934 0.2749 19.2783 0.2030 3.9132 4.2961 108.0866 1.7920 1.0070 64.5931 8.8486 14.1388 20.8510 153.2671 3.3863 0.4150 38.0981 26.3687 11.9267 3.6104 96.9675 116.5739 5.9965 3.1092 27.7436 31.8338 50.8437 20.3983 1.0937 633.3290 0.8329 5.3176 37.5925 56.7242 14.1440 5.0090 1.5841 2.9933 1.8907 0.9590 188.2726 32.2868 273.5881 3.9518 7.5716 5.0050 4.3192 3.3784 9.5767 18.2767 1.9959 2.0124 6.0289 3.6752 6.2142 38.7823 32.3137 45.8215 0.1353 12.8196 5.1111 11.2243 22.2035 34.4332 7.3419 8.4214 10.8372 10.7102 7.2563 319.0431 213.7949 221.7624 136.3528 0.1099 191.5381 22.2785 59.4306 500.2363 58.8007 50.0262 7.4836 13.7435 2.8322 23.3925 7.4239 11.1674 27.4950 43.5156 5.0602 10.1973 30.0001 40.1524 39.4406 24.8278 26.1362 23.3825 30.9226 19.7746 22.0799 10.2808 54.7176 16.7916 13.9868 38.6099 19.3879 16.3970 22.7085 23.2045 19.6269 16.8109 20.1068 14.1426 9.5537 3.9946 21.8675 4.8749 16.7841 24.1138 14.5770 14.0249 21.1101 5.8140 46.4818 2.1809 6.0974 20.7321 13.7723 15.1682 2.0782 24.9327 16.9198 9.5568 3.7978 7.5915 11.4332 8.9234 17.2054 4.1799
temp: 298.150 k
press: 1.00000 atm
elementType: 26 14 7 7 7 7 7 6 6 6 6 6 6 6 6 6 6 6 1 6 1 6 6 6 6 1 6 1 6 1 6 1 6 6 6 6 1 6 1 6 6 1 6 1 6 1 6 1 6 6 1 6 1 1 1 6 1 1 1 6 1 6 1 1 1 6 1 1 1 6 1 6 1 6 1 6 1 6 1 6 1 1 1 6 1 1 1 6 1 6 1 6 1 1 1 6 1 1 1 6 1 6 1 6 1 6 1 1 1
symmnumber: 1
zpe: 2360400.6 jmol-1
zpe.correction: 0.899029 hartree
zpe.thermalcorrener: 0.951666 hartree
zpe.thermalcorrenthalpy: 0.952610 hartree
zpe.thermalcorrgfe: 0.814717 hartree
zpe.sumelectzpe: -2659.357649 hartree
zpe.sumelectthermal: -2659.305012 hartree
zpe.sumelectthermalent: -2659.304068 hartree
zpe.sumelectthermalfe: -2659.441961 hartree
dipole: 2.3692 5.1998 -6.0101
dipole: 8.2929
quadrupole: -313.3977 -310.5029 -334.2026
quadrupole: 0.7893 1.3505 6.9176
quadrupole: 5.9700 8.8648 -14.8349 0.7893 1.3505 6.9176
hfenergy: -2660.256678 hartree
pointgroup: C01 [X(C51H51Fe1N5Si1)]
dipole: 0.9225216 2.0517409 -2.363142 debye
polarizability: 916.294604|30.301142|948.9781109|23.9513904|92.611841|700.4754744 unknown
InChI: InChI=1S/C38H33N4.C8H11Si.C5H5N.Fe.2H/c1-25-18-27(3)37(28(4)19-25)41-23-39(33-14-7-9-16-35(33)41)31-12-11-13-32(22-31)40-24-42(36-17-10-8-15-34(36)40)38-29(5)20-26(2)21-30(38)6;1-9(2)8-6-4-3-5-7-8;1-2-4-6-5-3-1;;;/h7-21H,1-6H3;3-7H,1-2H3;1-5H;;;/q;;-1;+1;;
charge 0 multiplicity 1
109 atoms
Fe 0.1414788 -0.16577889 0.18586315
Si -0.38488571 -1.60278404 2.13683452
N  -2.44806576 -0.84113036 -0.78483167
N  -2.66259506 1.19977734 -0.06064614
N  1.87746292 -2.28822575 -0.58813635
N  3.20810414 -0.76855533 0.21692055
N  0.58598572 0.89396665 -1.53444591
C  -0.35785503 -1.78252516 -0.70673149
C  -1.65912209 -1.96601679 -1.15231979
C  -1.75918537 0.18508627 -0.16817576
C  0.60032043 -2.72942978 -1.04040574
C  -2.29200423 2.56445014 0.17909433
C  3.7037108 0.52327918 0.58637861
C  3.72699328 0.89499221 1.93340961
C  -3.77819762 -0.50458907 -1.00190534
C  3.16020796 -2.80982971 -0.71055627
C  -1.48799019 5.2018385 0.5901447
C  4.18114696 2.17364452 2.25307121
H  4.19981579 2.47833966 3.29682938
C  -1.71990872 4.34782079 1.6705374
H  -1.57740995 4.7179154 2.68321632
C  -2.12775555 3.02803344 1.48769186
C  4.01685339 -1.82580508 -0.19961702
C  -2.08388292 3.39307224 -0.93083264
C  -2.03359502 -3.08184318 -1.89686745
H  -3.04288343 -3.23564163 -2.25978318
C  -4.8768967 -1.19683773 -1.5062256
H  -4.8055132 -2.2269964 -1.83088403
C  3.6714176 -4.01628546 -1.18555091
H  3.03093229 -4.80285926 -1.56315913
C  4.59091251 2.65122631 -0.06218394
H  4.92947786 3.33304135 -0.83896132
C  1.89187576 -1.04178802 0.01024076
C  4.14495363 1.38122959 -0.4287945
C  4.6065676 3.06782524 1.26933868
C  0.51728228 0.3444479 -2.75957823
H  0.2140687 -0.69496193 -2.79728209
C  5.05256449 -4.18645901 -1.14648791
H  5.47821578 -5.11601164 -1.51064706
C  -3.91320365 0.81146428 -0.54331172
C  0.28336202 -3.87389772 -1.77094756
H  1.01762321 -4.62168657 -2.04681998
C  5.90319591 -3.19114969 -0.64743945
H  6.974859 -3.36136601 -0.63387364
C  -1.68089346 4.70922718 -0.69974211
H  -1.50206071 5.35983518 -1.55270507
C  5.39533 -1.99012415 -0.1619615
H  6.04139999 -1.2117014 0.23074935
C  -2.10821511 -2.37396044 1.93420575
C  0.959288 2.18301922 -1.45639813
H  1.00459547 2.59767464 -0.45830123
C  -0.4587143 -0.94056838 3.92888823
H  0.46217111 -0.42268938 4.22059728
H  -0.60676572 -1.77633118 4.62372221
H  -1.2864896 -0.24031165 4.08300709
C  0.86446324 -3.01774042 2.27533072
H  0.90383732 -3.65786561 1.39099405
H  0.59354443 -3.64344178 3.13460184
H  1.87198226 -2.6276765 2.45397446
C  -1.04592674 -4.03146628 -2.18224147
H  -1.31587024 -4.91380492 -2.75465623
C  4.15525674 0.94916576 -1.87087461
H  4.97005064 0.24192614 -2.06310186
H  4.29323855 1.80808694 -2.53120286
H  3.22262563 0.44976507 -2.14781802
C  -2.28011394 2.88938438 -2.33603478
H  -3.3440065 2.76572197 -2.56625168
H  -1.80122847 1.91706088 -2.4850475
H  -1.85988304 3.59186871 -3.05916774
C  -5.12243633 1.49272663 -0.59575556
H  -5.20487233 2.51558616 -0.24267811
C  -6.21486756 0.80431036 -1.11400517
H  -7.17910159 1.29889596 -1.17071871
C  -6.09180284 -0.51973585 -1.55652868
H  -6.96562176 -1.03394828 -1.94371588
C  1.26884791 2.95090246 -2.57178571
H  1.55898066 3.98676195 -2.43608067
C  1.19472499 2.37434032 -3.83337695
H  1.43044002 2.9472941 -4.72459072
C  5.04980563 4.46061188 1.63497196
H  4.19419697 5.14547874 1.65436197
H  5.76896967 4.85299703 0.91028716
H  5.51186808 4.48557005 2.62592465
C  3.25156708 -0.053612 2.99609139
H  3.76066998 -1.02055484 2.92894327
H  2.1813284 -0.23636096 2.87513887
H  3.41948585 0.35890431 3.99369954
C  -2.27113927 -3.70086817 1.51528895
H  -1.39708826 -4.30300518 1.27866236
C  0.81031311 1.04134008 -3.92418299
H  0.7330287 0.53725864 -4.88093253
C  -2.36349978 2.1166117 2.65581872
H  -1.64040434 1.29803276 2.64000144
H  -3.3659039 1.67747653 2.62070901
H  -2.25424072 2.65227347 3.60176826
C  -1.06441576 6.62897863 0.8220816
H  -1.91766163 7.24269127 1.13323031
H  -0.64815223 7.07463391 -0.08540071
H  -0.31078462 6.69406225 1.61254881
C  -3.27040759 -1.63817561 2.210232
H  -3.18653149 -0.6047147 2.53668436
C  -4.53939658 -2.18980502 2.05286244
H  -5.42135879 -1.58911866 2.25790866
C  -4.67567976 -3.51002776 1.62596676
H  -5.66288914 -3.94561347 1.50032684
C  -3.53641677 -4.26687998 1.36315007
H  -3.63224446 -5.29711211 1.0311261
H  0.54059737 1.14287777 0.97923211
H  0.09313393 -0.04233716 1.68948428
