program: Gaussian 09
title: py-SiMe2Ph-HSi-scan-opt. From converged point at 1.44SiH bond.
version: ES64L-G09RevE.01
frameworkgroup: C1[X(C51H51FeN5Si)]
method: RwB97XD
basis: Gen
operation: Freq
keyword: #P
keyword: Geom=AllCheck
keyword: Guess=TCheck
keyword: SCRF=Check
keyword: GenChk
keyword: RwB97XD/ChkBas
keyword: Freq
converged: YES YES NO YES
title: Mulliken charges:
elementType: Fe Si N N N N N C C C C C C C C C C C H C H C C C C H C H C H C H C C C C H C H C C H C H C H C H C C H C H H H C H H H C H C H H H C H H H C H C H C H C H C H C H H H C H H H C H C H C H H H C H H H C H C H C H C H H H
charge: -0.993965 0.823836 -0.485727 -0.720167 -0.510132 -0.700210 -0.073301 -0.214904 0.231633 0.426971 0.205624 0.142879 0.143834 0.119712 0.270443 0.270696 0.109229 -0.237721 0.133964 -0.232885 0.133513 0.115666 0.235963 0.118854 -0.141419 0.133544 -0.156886 0.165303 -0.157378 0.166520 -0.236063 0.129942 0.432295 0.118500 0.109673 0.058199 0.170586 -0.169128 0.151519 0.230638 -0.155793 0.135353 -0.171228 0.152179 -0.240809 0.129833 -0.164005 0.176515 -0.103667 0.092174 0.192527 -0.618781 0.154048 0.148066 0.150930 -0.626188 0.171788 0.151077 0.158222 -0.201751 0.136341 -0.421282 0.156802 0.137952 0.171358 -0.419897 0.157379 0.171658 0.137348 -0.165067 0.175728 -0.172898 0.150876 -0.170622 0.150247 -0.150972 0.168225 -0.139135 0.169334 -0.437104 0.158347 0.145447 0.142522 -0.427426 0.156768 0.182128 0.138537 -0.147488 0.134216 -0.157429 0.169484 -0.421792 0.178155 0.155333 0.138734 -0.436761 0.152684 0.141031 0.151816 -0.124772 0.125348 -0.136506 0.145363 -0.153736 0.145138 -0.143109 0.142971 -0.149960 -0.061457
chargesum: -0.00000
title: Mulliken charges with hydrogens summed into heavy atoms:
elementType: Fe Si N N N N N C C C C C C C C C C C C C C C C C C C C C C C C C C C C C C C C C C C C C C C C C C C C C C C C C C C
charge: -1.143925 0.762379 -0.485727 -0.720167 -0.510132 -0.700210 -0.073301 -0.214904 0.231633 0.426971 0.205624 0.142879 0.143834 0.119712 0.270443 0.270696 0.109229 -0.103757 -0.099372 0.115666 0.235963 0.118854 -0.007874 0.008417 0.009142 -0.106120 0.432295 0.118500 0.109673 0.228785 -0.017609 0.230638 -0.020440 -0.019048 -0.110976 0.012509 -0.103667 0.284702 -0.165737 -0.145101 -0.065409 0.044830 0.046488 0.010661 -0.022022 -0.020375 0.017253 0.030199 0.009213 0.050006 -0.013272 0.012056 0.050431 0.008769 0.000575 0.008856 -0.008597 -0.000138
chargesum: 0.00000
polarizability: 9.11492758e+02 2.57487786e+01 9.50961740e+02 4.01562234e+01 9.06700687e+01 6.87251255e+02
1716.lowfreq: -14.2266 0.0012 0.0013 0.0015 5.9275 9.5816 15.7262 22.3414 31.0791
redmass: 4.7684 4.8309 5.1772 5.3957 5.3510 5.2304 4.7172 4.7848 4.8187 4.0546 4.3218 2.2409 2.2967 1.9392 3.8555 3.7847 1.8983 2.8856 4.2448 2.3191 4.0073 4.6590 3.2280 3.8206 3.4528 2.0537 4.3610 4.2619 3.2621 1.7538 2.6359 4.2818 1.4221 2.7411 1.7180 2.6619 3.5901 3.7702 2.4341 1.2685 1.3547 1.9878 3.6731 2.8316 5.1789 2.9495 3.7470 1.9532 3.0135 1.1333 2.5562 2.5296 4.4342 5.2249 6.5375 3.3961 3.1922 4.9144 5.1712 6.5859 4.8784 6.2106 5.4727 5.3720 2.6543 4.2889 3.1670 4.6255 3.1248 7.0235 3.4559 5.6912 4.1192 3.2243 3.7721 3.7733 3.1266 3.1656 3.9724 4.3952 4.1940 3.8323 4.0418 5.0412 4.7603 4.1447 3.9670 3.7486 2.2670 5.1642 4.3938 2.1975 6.3623 4.9990 6.7537 5.1446 5.0782 4.1222 6.1994 4.7447 6.2357 2.8711 1.7098 1.9868 2.7088 2.1228 1.7591 4.4360 5.2154 1.4342 3.4837 1.6938 3.0635 1.8187 3.3191 1.6652 3.9157 2.2405 1.9841 2.4662 3.0499 1.9283 4.8658 3.5353 1.4178 1.4649 1.4916 1.4044 1.3018 1.2914 1.2578 1.4234 1.2655 1.2975 1.2974 5.4426 1.3689 1.3656 1.9023 1.3791 1.5716 2.0209 2.3444 1.3590 3.2366 1.3601 4.5700 1.2756 1.2736 1.3769 7.3680 1.4296 5.4464 1.3256 1.3201 1.7487 1.5702 1.5594 1.4664 2.1100 2.0456 5.4371 5.9426 2.5617 1.7154 1.5990 4.7359 1.6218 1.6895 1.7501 1.5351 1.5604 2.0151 2.6491 1.6106 1.6005 1.6318 1.8002 1.8634 1.9078 1.4401 1.3614 1.0982 1.1779 1.1064 1.1672 2.0400 1.5113 1.4571 1.1321 1.8921 3.2207 1.1786 1.9058 3.5952 3.0666 3.2744 1.3716 1.3830 1.2729 1.2549 7.6281 3.2061 3.3765 2.2874 5.1708 4.7183 3.2664 3.8431 2.4760 2.5255 1.5013 1.6347 7.9976 7.2423 5.1562 2.1131 1.3521 1.3126 1.5143 1.4308 1.9489 1.5328 1.4870 4.2296 4.5522 1.0699 1.3799 1.6786 1.2284 1.0925 1.1221 1.8089 1.0723 1.1014 1.0628 1.0660 2.1805 1.1576 1.9185 1.2797 1.3486 1.0903 1.0717 1.1334 2.8462 1.6162 1.6130 2.1634 2.8675 3.1801 2.1661 2.7881 2.9383 1.2969 3.5772 3.5255 5.4128 6.9225 6.1838 7.8372 7.9819 8.0433 5.8163 7.5657 5.8745 7.6984 6.5516 6.6218 7.4798 7.5263 1.0317 1.0360 1.0370 1.0381 1.0381 1.0398 1.0373 1.0386 1.0393 1.1008 1.0975 1.1014 1.1005 1.0979 1.1013 1.1014 1.0978 1.1016 1.1036 1.1028 1.1036 1.1030 1.1032 1.1032 1.1006 1.0914 1.0916 1.0914 1.0872 1.0874 1.0915 1.0884 1.0907 1.0885 1.0890 1.0943 1.0873 1.0909 1.0988 1.0920 1.0936 1.0937 1.0972 1.0973 1.0946 1.0950 1.0956 1.0931 1.0950 1.0935
irintensity: 0.0795 0.3326 0.3556 0.3946 2.0818 0.4615 0.1589 1.9330 2.4468 0.4685 1.4794 0.3789 0.7743 0.5131 0.6980 1.1729 1.0217 1.9145 2.9674 2.8683 2.6107 0.2436 1.0609 0.5016 0.0258 2.2574 0.2463 0.8768 0.8026 0.5112 0.7933 2.9476 0.5855 0.4683 1.5936 7.2130 8.3779 2.5750 0.6776 1.0967 0.8989 4.8640 3.1672 2.1975 4.8474 0.6085 1.4315 1.6954 8.4343 0.4972 1.2975 0.8999 8.9919 52.1469 0.6778 0.0559 0.4593 1.8664 17.4159 1.8941 1.3862 11.7329 18.5228 11.2822 0.1696 0.6592 0.0744 9.6212 1.0100 8.6837 11.8234 0.8097 1.9756 17.4945 0.2398 0.7756 0.3584 0.0576 0.0567 0.2890 0.0761 0.3127 6.7627 9.7372 6.2967 0.6639 0.6884 0.6173 36.9964 8.1513 3.6231 28.5404 0.1433 0.3380 0.2452 1.0413 2.0654 37.4726 1.6938 5.9403 2.1989 25.4285 22.9505 43.1817 8.6631 76.8034 45.2733 2.2769 3.1420 68.4336 9.1866 39.6392 27.1719 95.3595 44.9358 22.3611 10.8083 26.2812 76.0251 40.4043 8.1190 15.6737 0.5349 7.8771 250.1418 0.4790 195.7493 0.0944 11.0931 20.8745 1.0187 0.1246 0.1970 0.4618 3.0548 12.9104 0.8137 0.3046 31.8426 2.4452 13.1275 1.6747 2.9864 37.0903 1.1599 4.1034 0.5825 0.1420 0.1673 0.2368 8.8827 1.2285 0.1506 0.2302 0.1200 14.5875 19.6374 5.3989 2.0219 2.8672 29.2423 3.2531 2.6579 0.6088 7.8052 7.9177 4.0344 20.0060 4.4923 0.4408 10.5733 16.4555 14.6237 2.3316 6.7260 18.3542 0.6702 15.6156 8.1513 76.3998 0.7962 94.1714 4.8224 9.2721 0.5734 1.1977 29.8430 2.7886 0.6094 1.0435 111.0441 26.6476 20.0922 47.8018 29.4031 47.7327 96.7610 1.7479 1.7695 50.8112 28.4159 9.4722 5.5912 97.6264 84.5529 8.2627 9.8299 30.5925 21.4674 29.1176 27.1391 1.3613 1.8418 734.0080 4.1974 14.9934 12.3753 6.7489 5.5921 5.7213 2.5099 6.6269 2.4834 7.2228 195.7811 295.7078 1.5225 4.0598 9.0787 2.0422 13.1972 11.6230 11.6970 19.1219 5.4822 5.9709 11.9439 3.9538 8.7127 38.7758 35.8805 16.0071 16.9309 8.6085 5.6278 7.9862 29.2451 17.5207 58.9260 18.4430 144.1259 1.7231 139.5268 258.9756 671.8284 303.5790 343.8364 0.5652 30.4628 24.0246 62.0896 15.9806 15.4457 3.9259 16.6737 14.5920 2.0695 9.3270 12.9106 21.0004 44.1985 501.7899 4.5248 38.3303 36.5392 48.1074 25.5448 9.0125 29.4231 24.2019 20.7619 10.0102 25.3682 10.2463 15.2238 9.1433 15.9912 15.3730 13.7759 21.1145 15.2164 34.8294 20.9520 21.1089 21.7248 3.9237 25.0359 14.3132 21.5628 8.2601 0.4720 18.7933 2.2001 6.2460 16.4549 5.3219 32.0708 1.9463 12.0739 27.9243 17.5576 4.7267 34.2617 1.3009 17.9825 4.1378 15.4088 8.2241 11.7519 8.2848 9.9271
temp: 298.150 k
press: 1.00000 atm
elementType: 26 14 7 7 7 7 7 6 6 6 6 6 6 6 6 6 6 6 1 6 1 6 6 6 6 1 6 1 6 1 6 1 6 6 6 6 1 6 1 6 6 1 6 1 6 1 6 1 6 6 1 6 1 1 1 6 1 1 1 6 1 6 1 1 1 6 1 1 1 6 1 6 1 6 1 6 1 6 1 6 1 1 1 6 1 1 1 6 1 6 1 6 1 1 1 6 1 1 1 6 1 6 1 6 1 6 1 1 1
symmnumber: 1
zpe: 2362373.9 jmol-1
zpe.correction: 0.899781 hartree
zpe.thermalcorrener: 0.953378 hartree
zpe.thermalcorrenthalpy: 0.954322 hartree
zpe.thermalcorrgfe: 0.812848 hartree
zpe.sumelectzpe: -2659.356749 hartree
zpe.sumelectthermal: -2659.303152 hartree
zpe.sumelectthermalent: -2659.302208 hartree
zpe.sumelectthermalfe: -2659.443681 hartree
dipole: 1.1135 2.4862 -3.9179
dipole: 4.7719
quadrupole: -311.5550 -305.4877 -329.5463
quadrupole: 3.1772 -0.1045 -0.6784
quadrupole: 3.9747 10.0420 -14.0166 3.1772 -0.1045 -0.6784
hfenergy: -2660.2565298 hartree
pointgroup: C01 [X(C51H51Fe1N5Si1)]
dipole: 0.4788803 0.985374 -1.5246109 debye
polarizability: 912.7589787|25.8563272|946.5501452|44.7775888|93.2038968|690.3966297 unknown
InChI: InChI=1S/C38H33N4.C8H12Si.C5H5N.Fe.H/c1-25-18-27(3)37(28(4)19-25)41-23-39(33-14-7-9-16-35(33)41)31-12-11-13-32(22-31)40-24-42(36-17-10-8-15-34(36)40)38-29(5)20-26(2)21-30(38)6;1-9(2)8-6-4-3-5-7-8;1-2-4-6-5-3-1;;/h7-21H,1-6H3;3-7,9H,1-2H3;1-5H;;/q;;-1;+1;
charge 0 multiplicity 1
109 atoms
Fe 0.15282819 -0.09317292 0.07428131
Si -0.5137567 -1.87741167 2.38211345
N  -2.47755113 -0.65239928 -0.88327258
N  -2.60441508 1.37687124 -0.11392267
N  1.77556913 -2.32103347 -0.67681781
N  3.18509768 -0.87768133 0.13072943
N  0.65742005 1.03078686 -1.54664911
C  -0.41949971 -1.66958387 -0.86534854
C  -1.7475266 -1.82835267 -1.23074759
C  -1.74309935 0.33244394 -0.24817069
C  0.46990557 -2.70298833 -1.11501922
C  -2.20909056 2.69746767 0.27816954
C  3.74653557 0.36626576 0.56143095
C  3.73985158 0.69257457 1.91951626
C  -3.78292243 -0.24375048 -1.11984253
C  3.02848228 -2.90762566 -0.8067935
C  -1.39758549 5.26160525 1.00322847
C  4.27501713 1.92324972 2.30091706
H  4.26969189 2.19246776 3.35443178
C  -1.65884433 4.29300421 1.97530675
H  -1.53225117 4.54280233 3.02617272
C  -2.06662136 3.00522628 1.63551925
C  3.93695415 -1.97508482 -0.28747091
C  -1.96080877 3.63977955 -0.7261882
C  -2.21273329 -2.99452029 -1.8348878
H  -3.25020335 -3.14608858 -2.10850776
C  -4.89734501 -0.85548339 -1.69116025
H  -4.86275692 -1.86610626 -2.07629146
C  3.4777961 -4.1275864 -1.31020418
H  2.7989994 -4.86667601 -1.71590354
C  4.80174737 2.44711344 0.01993864
H  5.210374 3.13199141 -0.71989711
C  1.85847962 -1.07238562 -0.085223
C  4.27823259 1.22811 -0.40744586
C  4.80401514 2.81367397 1.36749685
C  0.54180956 0.56234804 -2.80156761
H  0.15818155 -0.44685518 -2.89450156
C  4.84800471 -4.37016269 -1.2754405
H  5.22537555 -5.31137635 -1.66235538
C  -3.86505884 1.06308361 -0.62202363
C  0.06420426 -3.90040671 -1.70415216
H  0.73950223 -4.72697469 -1.89340047
C  5.74928746 -3.4314165 -0.75558676
H  6.81060633 -3.65757236 -0.74530829
C  -1.55512418 4.9181821 -0.3385907
H  -1.35037026 5.65922047 -1.10778298
C  5.30487654 -2.21297447 -0.25188593
H  5.99108085 -1.47457159 0.1499373
C  -2.19982655 -2.5561149 1.91478763
C  1.12636286 2.28072023 -1.39234482
H  1.20431919 2.62090354 -0.36796657
C  -0.59338757 -1.23774161 4.15163632
H  0.34816435 -0.75698953 4.43888599
H  -0.7812626 -2.06345401 4.84764641
H  -1.39535485 -0.50281581 4.27720354
C  0.79500982 -3.21307619 2.27466659
H  0.78633542 -3.73275097 1.31418368
H  0.61516931 -3.95180269 3.06484441
H  1.79347187 -2.79448664 2.43048291
C  -1.28596253 -4.02026619 -2.05674212
H  -1.62688425 -4.94313718 -2.51627568
C  4.28602755 0.85470284 -1.86599429
H  5.04011567 0.08720208 -2.07406832
H  4.51325806 1.72499429 -2.48574925
H  3.3190446 0.45131871 -2.18070369
C  -2.12098583 3.29376357 -2.18277709
H  -3.17923236 3.21473443 -2.45574096
H  -1.65374331 2.33322383 -2.41951441
H  -1.66719467 4.06080515 -2.81428178
C  -5.03903265 1.80392921 -0.6758334
H  -5.08043838 2.81622725 -0.28698154
C  -6.1491648 1.1906575 -1.24771957
H  -7.08672638 1.73362643 -1.3088804
C  -6.07559923 -0.11705274 -1.74681154
H  -6.95921138 -0.56818516 -2.1869199
C  1.49047008 3.08873332 -2.46219966
H  1.86192918 4.08870225 -2.26786966
C  1.37016733 2.59610999 -3.75572032
H  1.64799029 3.20221845 -4.61226622
C  5.3483826 4.15322898 1.7917075
H  4.65844854 4.95679055 1.51093409
H  6.30721792 4.36291252 1.30729159
H  5.49364122 4.20259289 2.87407738
C  3.12969241 -0.23614338 2.92985845
H  3.51702097 -1.2546727 2.82564988
H  2.04634178 -0.26911784 2.77856321
H  3.32646952 0.108064 3.94803625
C  -2.3689397 -3.89711512 1.54687163
H  -1.50905343 -4.56048192 1.4986034
C  0.88404112 1.30426912 -3.9243382
H  0.76632724 0.8659797 -4.90910275
C  -2.30841562 1.96054693 2.68790368
H  -1.56628842 1.16299176 2.58460537
H  -3.30387664 1.51581687 2.58665949
H  -2.220708 2.38743111 3.68980426
C  -0.97417255 6.65069301 1.40552009
H  -1.82056489 7.21097212 1.81886478
H  -0.58631993 7.21259017 0.55167309
H  -0.19807184 6.61891707 2.17616315
C  -3.33850793 -1.73805936 1.9539018
H  -3.24165386 -0.69141375 2.23072093
C  -4.59568172 -2.23205707 1.61915525
H  -5.45959085 -1.57377359 1.63972296
C  -4.74103097 -3.56832431 1.24818824
H  -5.72054676 -3.95799815 0.98652011
C  -3.62603723 -4.40186619 1.21863484
H  -3.73328661 -5.44434851 0.93294911
H  0.58500418 1.15609784 1.02507075
H  -0.16670673 -0.57415874 1.67816489
