program: Gaussian 09
title: py-SiHPh2-N2-opt-thf. From x-ray structure.
version: ES64L-G09RevE.01
frameworkgroup: C1[X(C55H49FeN7Si)]
method: RwB97XD
basis: Gen
operation: Freq
keyword: #PGeom=AllCheck
keyword: Guess=TCheck
keyword: SCRF=Check
keyword: GenChk
keyword: RwB97XD/ChkBas
keyword: Freq
converged: YES YES NO YES
title: Mulliken charges:
elementType: Fe Si N N N N N N N C C C H C H C H C H C C C C H C H C H C C C C H C H C H C H C C C C H H H C H C C H H H C H C C H H H C C C H H H C H C C H H H C H C C H H H C H C H C H C H C H C C H C H C H C H C H C C H C H C H C H C H H
charge: -1.067940 0.845092 -0.732917 -0.538500 -0.531893 -0.737989 -0.183994 -0.081619 0.010351 0.480947 0.240082 -0.166215 0.177719 -0.169255 0.152326 -0.169399 0.151857 -0.157494 0.166073 0.278628 -0.080727 0.213302 -0.156583 0.140636 -0.205096 0.140826 -0.149525 0.140155 0.250856 0.451616 0.275929 -0.151692 0.165842 -0.170253 0.150479 -0.169368 0.150873 -0.168752 0.176410 0.234554 0.120130 0.122972 -0.416075 0.174104 0.139545 0.164279 -0.236709 0.133243 0.107771 -0.435487 0.145617 0.147992 0.156938 -0.228543 0.138440 0.108153 -0.415949 0.162251 0.143609 0.164835 0.116280 0.110535 -0.413034 0.140275 0.167837 0.163249 -0.221079 0.137973 0.110141 -0.437666 0.155688 0.141682 0.154394 -0.242229 0.133909 0.124568 -0.417231 0.139533 0.171059 0.161864 0.074361 0.178314 -0.152085 0.174282 -0.133663 0.174801 -0.159914 0.175560 0.070653 0.175781 -0.093647 -0.136911 0.120536 -0.147038 0.134363 -0.157928 0.136245 -0.142309 0.135056 -0.142178 0.115517 -0.099813 -0.170611 0.127666 -0.143948 0.136378 -0.160567 0.138896 -0.148686 0.135865 -0.130567 0.118933 -0.203547
chargesum: -0.00000
title: Mulliken charges with hydrogens summed into heavy atoms:
elementType: Fe Si N N N N N N N C C C C C C C C C C C C C C C C C C C C C C C C C C C C C C C C C C C C C C C C C C C C C C C C C C C C C C C
charge: -1.067940 0.641545 -0.732917 -0.538500 -0.531893 -0.737989 -0.183994 -0.081619 0.010351 0.480947 0.240082 0.011504 -0.016930 -0.017542 0.008579 0.278628 -0.080727 0.213302 -0.015947 -0.064270 -0.009370 0.250856 0.451616 0.275929 0.014150 -0.019775 -0.018495 0.007658 0.234554 0.120130 0.122972 0.061853 -0.103466 0.107771 0.015060 -0.090104 0.108153 0.054746 0.116280 0.110535 0.058328 -0.083107 0.110141 0.014097 -0.108320 0.124568 0.055224 0.252676 0.022197 0.041138 0.015646 0.246435 -0.093647 -0.016375 -0.012675 -0.021683 -0.007253 -0.026660 -0.099813 -0.042945 -0.007570 -0.021672 -0.012820 -0.011634
chargesum: 0.00000
polarizability: 9.92375036e+02 -3.02141317e-01 9.95715320e+02 -3.81926842e+00 -1.39751578e+02 8.28671259e+02
1716.lowfreq: -13.0542 -10.3790 -8.1586 0.0006 0.0012 0.0013 16.8074 19.1141 29.0228
redmass: 5.0764 5.1841 5.0288 5.3141 4.9788 4.5220 4.6182 5.4324 4.8727 5.1164 4.0003 4.9634 4.3973 4.5999 4.8211 3.5484 1.0573 3.5482 3.8730 4.8706 4.4449 4.4698 4.3922 3.7592 1.1333 3.0997 3.8122 4.2201 2.3963 2.6436 1.2143 4.1822 4.8511 4.0126 4.6398 1.8960 2.8893 1.8753 2.4042 3.3183 4.7452 3.2924 3.1263 3.5427 3.6370 3.7944 3.3451 5.4207 3.2509 3.4214 3.0891 2.5567 2.5782 5.2219 7.9481 8.2743 3.5489 4.1443 5.0362 6.7670 5.4860 7.2494 4.7650 4.7827 2.6229 4.8153 3.6175 5.3831 5.4079 3.1733 6.0299 6.1989 3.5132 3.7510 8.1531 7.0443 3.9899 3.9056 7.0164 3.7769 3.8866 3.8138 9.6341 3.1163 3.0988 4.4616 4.5961 4.4649 4.2082 4.2944 4.6300 4.5941 4.2255 4.4426 4.8288 5.1232 5.0143 5.3869 5.6094 5.9605 6.3882 7.0125 5.1114 5.4923 6.3371 6.2320 6.4870 5.5193 5.9415 3.5905 1.7621 1.5660 1.6734 3.4705 1.8542 4.9922 1.8899 1.5813 4.4137 4.2783 1.9084 4.4336 1.6408 1.7642 5.4230 3.4425 1.2702 5.3925 5.9044 4.9242 1.1081 1.4946 1.2692 1.4142 1.3071 1.3147 1.3891 1.2557 1.2618 1.3091 1.3030 1.3842 1.3583 5.4420 1.3484 1.3559 3.9129 1.3953 2.1484 2.3348 1.3817 3.3955 4.5527 1.4068 1.2839 1.4447 1.4743 4.3112 1.2679 1.3593 5.1150 5.3999 1.3368 1.3300 1.6862 1.5599 1.4689 7.3523 2.0346 1.5575 2.0206 2.9047 3.0502 1.9952 2.9397 3.2514 2.2972 1.7148 1.6326 1.8030 1.5406 1.5093 1.5065 4.8844 1.5593 1.6317 1.6504 1.7553 1.7349 2.5952 2.5670 1.7843 1.4089 1.0995 1.0993 1.1699 1.1054 1.2342 1.8169 1.6327 1.3769 1.1329 1.9282 1.1391 2.9120 2.0780 3.4491 3.0016 1.3517 2.8210 1.3981 1.3892 7.6899 3.5425 3.6739 3.7374 2.5333 5.1378 5.2862 3.2835 3.8570 2.5476 3.9112 1.6109 1.5448 7.8376 7.0479 4.7318 1.2322 2.9042 2.6640 1.2901 1.2476 1.3285 1.3738 1.4425 1.4112 3.7952 3.8794 1.7330 1.8334 2.1572 2.0868 1.0818 1.0909 1.0448 1.1806 1.0523 1.1642 1.2285 1.0700 2.0598 1.1220 2.0409 1.3065 1.6518 1.7390 2.3925 3.0460 2.1307 2.1696 2.9239 3.3605 3.6703 1.9540 3.7695 4.2733 5.3768 5.3104 7.0675 7.3893 5.7379 5.7469 7.8791 5.7627 7.9371 7.5558 7.7258 6.6240 5.3795 6.5005 7.5387 7.5895 1.0407 13.6691 1.0378 1.0388 1.0418 1.0408 1.0368 1.0373 1.1018 1.1001 1.0960 1.0968 1.1017 1.1012 1.1034 1.1040 1.1034 1.1033 1.1031 1.1035 1.0862 1.0873 1.0915 1.0857 1.0916 1.0916 1.0882 1.0922 1.0915 1.0932 1.0966 1.0877 1.0887 1.0873 1.0965 1.0948 1.0917 1.0884 1.0921 1.0928 1.0977 1.0922 1.0970 1.0936 1.0951 1.0957 1.0977 1.0936 1.0932 1.0932
irintensity: 0.1153 0.1494 0.8664 1.4389 0.9077 0.2221 0.4302 0.1304 0.2750 0.7065 0.5442 0.9341 0.1592 0.8818 0.1200 0.1042 0.4432 0.4248 0.8586 0.4219 0.2387 0.6628 0.0695 0.1154 0.4845 0.3350 0.5972 0.0999 0.0868 1.8886 1.2742 1.4846 1.3902 0.4271 0.1012 0.4639 0.0517 2.8074 1.1604 1.6056 4.0075 1.1302 1.0888 3.4273 4.3929 0.1444 2.0207 0.2729 0.7437 1.3100 0.6097 0.7463 1.3431 24.1133 15.3831 10.4582 0.0817 4.9536 0.5919 0.6494 12.9327 6.5540 3.4211 4.3602 0.1926 10.6570 4.2340 7.8374 7.5088 4.1582 32.9970 18.9362 3.4252 13.3241 66.2635 43.7358 0.6822 21.1054 31.7864 24.6238 44.4540 0.2433 39.7989 0.4549 0.0689 4.5427 2.7567 1.7997 0.1794 12.2287 9.4348 4.6719 0.8710 0.2388 0.4993 4.9654 98.2740 0.9762 0.8172 0.9128 0.6411 0.8278 5.2109 1.4716 0.2696 4.0255 8.2023 3.0739 8.8512 8.7359 72.3525 54.7101 29.4068 12.3529 78.1326 10.5324 70.5819 112.6917 17.8735 1.1142 57.7298 1.4373 90.1782 77.5857 7.0318 37.3792 243.5368 15.7044 0.1768 8.5780 242.2788 0.1380 3.8070 0.1607 29.5694 6.2360 5.1130 1.3498 0.5193 0.0891 0.3863 1.8291 0.5775 7.0781 7.2282 3.3650 3.8581 4.2936 3.7196 1.3580 0.7113 0.5784 0.4939 0.6343 0.0986 0.0415 1.4793 6.5908 0.2435 0.4469 0.0042 0.2465 1.2841 0.1074 14.7261 17.2433 2.0973 3.2378 5.6341 1.2650 20.6140 3.6134 1.4838 8.0643 21.9097 5.8625 6.4915 22.8969 5.0102 2.9884 9.2585 5.2968 11.9864 2.1188 19.9076 2.6607 7.1470 5.9498 6.7284 38.9752 24.5002 3.8166 0.9162 3.9230 0.3454 8.5645 0.1196 5.8518 15.6612 6.8766 3.4882 1.2794 96.1786 1.3829 10.8860 87.0279 4.1473 21.2418 14.9406 133.0852 3.6482 0.6636 9.3450 8.8040 10.7545 233.5063 107.1029 10.6178 7.3384 53.2115 44.9366 66.6171 28.8259 1.7784 2.6321 663.1909 3.7113 48.8957 2.2480 66.0064 21.9121 3.8680 2.1531 0.9793 1.8248 5.0948 1.1894 196.9331 238.7489 2.1374 2.4233 10.6262 27.0932 9.0460 1.7484 14.3139 33.4699 11.6087 0.8270 37.9244 17.4160 63.5582 7.4361 11.2854 16.6357 11.8384 42.0268 9.0880 2.5752 5.8649 9.1928 0.0464 51.7928 492.0533 40.5859 206.6806 146.9159 1.6930 0.4727 23.9592 48.2931 2.5061 0.7294 16.8719 0.7536 22.3543 10.7653 3.0826 18.5628 19.7171 17.9394 15.2379 33.0525 420.0389 1237.0960 36.7200 39.7026 22.0289 26.6500 17.8908 23.0887 17.9270 18.6428 14.6159 12.7050 7.2127 10.4641 21.8495 21.3458 24.5289 18.2040 10.3682 25.5355 5.7204 1.8402 20.7711 3.4221 19.1092 17.0704 3.9173 37.7090 17.3412 34.8003 40.3978 1.2863 13.1620 1.8977 36.4482 25.2052 15.4203 1.7180 10.9234 20.0223 20.1554 5.6698 25.9759 4.9407 0.3765 9.5810 14.6651 7.7532 14.4919 8.3765
temp: 298.150 k
press: 1.00000 atm
elementType: 26 14 7 7 7 7 7 7 7 6 6 6 1 6 1 6 1 6 1 6 6 6 6 1 6 1 6 1 6 6 6 6 1 6 1 6 1 6 1 6 6 6 6 1 1 1 6 1 6 6 1 1 1 6 1 6 6 1 1 1 6 6 6 1 1 1 6 1 6 6 1 1 1 6 1 6 6 1 1 1 6 1 6 1 6 1 6 1 6 1 6 6 1 6 1 6 1 6 1 6 1 6 6 1 6 1 6 1 6 1 6 1 1
symmnumber: 1
zpe: 2411271.3 jmol-1
zpe.correction: 0.918405 hartree
zpe.thermalcorrener: 0.974837 hartree
zpe.thermalcorrenthalpy: 0.975782 hartree
zpe.thermalcorrgfe: 0.828122 hartree
zpe.sumelectzpe: -2920.040132 hartree
zpe.sumelectthermal: -2919.983700 hartree
zpe.sumelectthermalent: -2919.982755 hartree
zpe.sumelectthermalfe: -2920.130415 hartree
dipole: -0.5080 9.1587 7.5549
dipole: 11.8834
quadrupole: -339.8514 -341.3880 -360.5187
quadrupole: 2.2068 -1.7809 -11.3874
quadrupole: 7.4013 5.8647 -13.2660 2.2068 -1.7809 -11.3874
hfenergy: -2920.958537 hartree
pointgroup: C01 [X(C55H49Fe1N7Si1)]
dipole: -1.7248492 4.3415766 0.184594 debye
polarizability: 939.2978892|136.5409026|883.7993574|16.5454625|-82.0322579|993.6643687 unknown
InChI: InChI=1S/C38H33N4.C12H11Si.C5H5N.Fe.N2/c1-25-18-27(3)37(28(4)19-25)41-23-39(33-14-7-9-16-35(33)41)31-12-11-13-32(22-31)40-24-42(36-17-10-8-15-34(36)40)38-29(5)20-26(2)21-30(38)6;1-3-7-11(8-4-1)13-12-9-5-2-6-10-12;1-2-4-6-5-3-1;;1-2/h7-21H,1-6H3;1-10,13H;1-5H;;/q;;-1;+1;
charge 0 multiplicity 1
113 atoms
Fe 16.88386141 27.90098411 6.19237451
Si 17.97132035 25.82553589 5.91403766
N  15.03926496 27.60195958 3.70245728
N  14.44093702 26.60542975 5.53875716
N  17.36520973 27.38646778 8.94470088
N  18.98304308 28.71618091 8.34942467
N  15.94736856 29.74561496 6.48156354
N  18.10196762 28.59587642 4.99592963
N  18.87313542 28.9469553 4.27008968
C  15.44269677 27.37633533 4.98273124
C  13.8308056 26.96061961 3.43297075
C  13.06955482 26.9017712 2.27359724
H  13.37901927 27.42205565 1.37310092
C  11.90099343 26.14755886 2.32260003
H  11.27720346 26.07397314 1.43768582
C  11.52063093 25.47831137 3.49297114
H  10.60818514 24.89069087 3.49705442
C  12.28502538 25.54504073 4.65491084
H  11.97971909 25.01286327 5.54639079
C  13.44879373 26.3087316 4.61163242
C  15.78803478 26.88935316 7.36627304
C  14.60313127 26.31725481 6.91793265
C  13.76354944 25.59431545 7.76350225
H  12.83770586 25.14273582 7.4265321
C  14.14756684 25.4654249 9.10381157
H  13.50499213 24.91283689 9.78227568
C  15.3304026 26.02634848 9.59645759
H  15.58748583 25.90066491 10.64146036
C  16.13593366 26.72664232 8.70172156
C  17.87619325 28.07993769 7.86692133
C  18.17518367 27.51710019 10.0666576
C  18.14945216 26.96012766 11.34248896
H  17.38658568 26.25445281 11.64505299
C  19.16699917 27.3255282 12.21966732
H  19.17607919 26.90338443 13.21940496
C  20.18013552 28.21583316 11.84062495
H  20.95561788 28.47760402 12.55318733
C  20.2156879 28.76212016 10.56108123
H  20.99967141 29.44514593 10.25053081
C  19.2044233 28.3869488 9.6871585
C  19.58878718 29.84042883 7.69721767
C  19.03627156 31.10734258 7.93647323
C  17.90544625 31.29279344 8.91276531
H  17.1022001 30.57019857 8.74634464
H  17.4848681 32.2975443 8.8323376
H  18.25670829 31.15363677 9.94149208
C  19.57936212 32.19859268 7.26007792
H  19.1499236 33.18433474 7.42275725
C  20.65541947 32.05436901 6.38225051
C  21.23654046 33.2520068 5.67688514
H  20.46228461 33.98699595 5.43868388
H  21.73421143 32.96340145 4.74711954
H  21.98042251 33.75203097 6.30797758
C  21.20250359 30.78377313 6.20234708
H  22.04816408 30.65612065 5.53078969
C  20.68910217 29.66202714 6.85552023
C  21.29030797 28.30274658 6.64082735
H  21.55457353 27.83365951 7.59385819
H  22.19377281 28.37132196 6.03037721
H  20.58612725 27.63783271 6.13128955
C  15.64947014 28.55017908 2.82056778
C  16.71521409 28.15411879 2.0063555
C  17.24540172 26.75039647 2.05654538
H  17.81590072 26.51473133 1.15467079
H  16.44600124 26.01381813 2.16757503
H  17.91275101 26.62815826 2.91556125
C  17.30171578 29.11432699 1.18363049
H  18.13625231 28.82395815 0.54937811
C  16.85250293 30.43653305 1.16152468
C  17.5136126 31.44942845 0.26304508
H  18.5978399 31.45932203 0.41347456
H  17.13364562 32.45716259 0.45027425
H  17.33428386 31.21257178 -0.79150167
C  15.77108077 30.78680347 1.97009565
H  15.39954382 31.80871466 1.95340775
C  15.14401953 29.85624864 2.80008276
C  13.93902737 30.24174835 3.6156104
H  13.84159837 31.32802162 3.67449094
H  13.99022526 29.84384877 4.63215544
H  13.02378764 29.84552818 3.16062981
C  16.40170538 30.87398299 5.91427712
H  17.28955726 30.79128382 5.30118906
C  15.79402292 32.11020233 6.08659048
H  16.21594626 32.98234972 5.60003074
C  14.65832231 32.19833258 6.88170642
H  14.15926378 33.14930983 7.03686637
C  14.17876126 31.03477262 7.47264013
H  13.29616066 31.04064374 8.1023101
C  14.84764303 29.83937325 7.24849823
H  14.50099491 28.91525348 7.69535464
C  18.55766323 24.92239989 7.49525038
C  17.73156026 24.04378327 8.2118893
H  16.73649134 23.81357446 7.83903927
C  18.1444173 23.4621591 9.40961834
H  17.47812998 22.78644008 9.93949695
C  19.4043569 23.75031178 9.93002868
H  19.72570089 23.30488807 10.86734715
C  20.2505823 24.60966439 9.2327965
H  21.23828046 24.8389059 9.62383864
C  19.82965006 25.17631874 8.03135258
H  20.50843993 25.83841552 7.50262029
C  17.19934644 24.43368853 4.84890951
C  17.89054128 23.95465092 3.72365811
H  18.86526883 24.37175951 3.48016209
C  17.35914687 22.96851567 2.89385071
H  17.92016523 22.63115206 2.02636109
C  16.11042006 22.41918768 3.174451
H  15.68875891 21.65465476 2.52797651
C  15.41190419 22.85535173 4.2979716
H  14.44188503 22.4277456 4.53772852
C  15.95347298 23.84299289 5.11904027
H  15.38603445 24.15345134 5.99067877
H  19.28512021 26.00222606 5.17812945
