program: Gaussian 16
title: Title Card Required
version: ES64L-G16RevC.01
frameworkgroup: C1[X(C44H48O34Zr6)]
method: RM06
basis: Gen
operation: Freq
keyword: #pfreq=noraman
keyword: M06/gen
keyword: integral=grid=ultrafine
keyword: pseudo=read
keyword: scf=(intrep,xqc,maxconventionalcycles=150)
title: #p freq=noraman M06/gen integral=grid=ultrafine pseudo=read scf=(intre
basis: NPDir=0 NMtPBC= 1 NCelOv= 1 NCel= 1 NClECP= 1 NCelD= 1
basis: NCelK= 1 NCelE2= 1 NClLst= 1 CellRange= 0.0.
basis: One-electron integrals computed using PRISM.
basis: One-electron integral symmetry used in STVInt
converged: YES YES YES YES
title: Mulliken charges:
elementType: Zr Zr Zr Zr Zr Zr O O O O O O O O O O O O O O O O O O O O O O O O O O O O O O C C C C C C C C C C C C C C C C C C C C C C C C C C C C C C C C C C C H H H H H H H H H H H H H H H H H H H H H H H H H H H H H H H C H C H H H C H H H O C C H H H H C H H H C H H H C O C O O
charge: 1.305093 1.478749 1.475430 1.432135 1.368842 1.341787 -0.589799 -0.402279 -0.413464 -0.401451 -0.808047 -0.408052 -0.798312 -0.624899 -0.399247 -0.420087 -0.404723 -0.414975 -0.402438 -0.401355 -0.589651 -0.403360 -0.805037 -0.586248 -0.402205 -0.401713 -0.402167 -0.402326 -0.399041 -0.407054 -0.399862 -0.405266 -0.807026 -0.402666 -0.428685 -0.393622 -0.032833 -0.026552 -0.012810 -0.001351 0.423135 0.412873 -0.007417 -0.010836 -0.016883 -0.020383 -0.052232 -0.012365 0.435580 0.003680 -0.008176 0.421301 0.422777 -0.007407 -0.045990 0.409110 0.424519 0.424836 -0.019255 0.425133 -0.013265 -0.046048 -0.029386 -0.016232 0.426547 -0.006859 0.455132 -0.004074 -0.001847 -0.009934 -0.011075 0.048331 0.019521 0.042907 0.252351 0.017060 0.017109 0.015588 0.050133 0.043302 0.345186 0.046213 0.248665 0.251825 0.051576 0.049744 0.049197 0.015852 0.017355 0.018926 0.018393 0.020959 0.023063 0.020859 0.022532 0.034485 0.034291 0.032815 0.033031 0.032824 0.033134 0.034637 0.159832 -0.148591 -0.000222 0.065706 0.029116 0.060923 -0.039465 0.029460 0.071628 0.075423 -0.441335 0.019894 -0.018251 0.082199 0.053235 0.042156 0.045375 0.008897 0.054851 0.034523 0.070385 0.142786 0.051984 0.060207 0.069000 0.157493 -0.427575 0.199494 -0.283558 -0.315823
chargesum: -0.00000
polarizability: 8.52256551e+02 -2.61695393e+01 7.19094725e+02 9.56678355e-02 -9.57747389e+00 7.26561311e+02
temp: 298.150 k
press: 1.00000 atm
elementType: 40 40 40 40 40 40 8 8 8 8 8 8 8 8 8 8 8 8 8 8 8 8 8 8 8 8 8 8 8 8 8 8 8 8 8 8 6 6 6 6 6 6 6 6 6 6 6 6 6 6 6 6 6 6 6 6 6 6 6 6 6 6 6 6 6 6 6 6 6 6 6 1 1 1 1 1 1 1 1 1 1 1 1 1 1 1 1 1 1 1 1 1 1 1 1 1 1 1 1 1 1 1 6 1 6 1 1 1 6 1 1 1 8 6 6 1 1 1 1 6 1 1 1 6 1 1 1 6 8 6 8 8
symmnumber: 1
zpe: 2395385.5 jmol-1
zpe.correction: 0.912354 hartree
zpe.thermalcorrener: 0.995715 hartree
zpe.thermalcorrenthalpy: 0.996659 hartree
zpe.thermalcorrgfe: 0.802481 hartree
zpe.sumelectzpe: -4541.291689 hartree
zpe.sumelectthermal: -4541.208328 hartree
zpe.sumelectthermalent: -4541.207384 hartree
zpe.sumelectthermalfe: -4541.401562 hartree
dipole: 1.7246 9.4728 0.0838
dipole: 9.6289
quadrupole: -519.0362 -531.7167 -551.8027
quadrupole: -3.9214 0.5941 -2.1282
quadrupole: 15.1491 2.4685 -17.6175 -3.9214 0.5941 -2.1282
hfenergy: -4542.2040431 hartree
pointgroup: C01 [X(C44H48O34Zr6)]
dipole: 0.678522 3.7268945 0.032979 debye
polarizability: 852.2565475|-26.1695477|719.0947287|0.0956672|-9.5774739|726.5613114 unknown
InChI: InChI=1S/C9H17O4.4C7H5O2.7CHO2.4HO.4O.6Zr/c1-8(2,11)14-9(3,12)6-5-7(10)13-4;4*8-7(9)6-4-2-1-3-5-6;7*2-1-3;;;;;;;;;;;;;;/h5-6H2,1-4H3;4*1-5H;7*1H;4*1H;;;;;;;;;;/q12*-2;;;;;;;;;6*+4
charge 0 multiplicity 1
132 atoms
Zr 0.013358 0.795208 -1.616287
Zr -0.670731 -3.169528 1.389483
Zr -0.521864 -2.682033 -2.111894
Zr -2.80521 -0.789867 -0.158266
Zr 2.137613 -1.563188 -0.044857
Zr -0.150676 0.314259 1.916303
O  -1.63704 -0.699132 -2.098815
O  0.004062 0.452038 -3.840699
O  -3.611038 0.93076 -1.329099
O  -0.275628 -1.758335 -4.139115
O  0.750132 -1.156992 -1.534281
O  -1.8290 1.938716 -2.239318
O  -1.169203 0.463516 0.084686
O  1.314705 0.582776 0.201552
O  2.130728 1.068348 -2.392061
O  3.488846 -0.282965 -1.238047
O  1.34734 -3.566973 -2.955527
O  -3.729876 0.555645 1.356495
O  -0.941927 -4.857567 -1.78118
O  -1.032892 -5.171129 0.4424
O  -1.804168 -1.258184 1.81887
O  -2.559884 -3.047475 -2.968724
O  -1.583999 -2.470622 -0.343549
O  0.755092 -3.363946 -0.361478
O  -4.126837 -2.237709 0.940054
O  -4.009905 -1.862944 -1.724995
O  -2.772844 -3.737812 1.9248
O  2.924845 -3.259187 1.203092
O  3.038145 -2.886323 -1.639364
O  -2.080015 1.162709 2.744411
O  -0.287044 -0.653926 3.942401
O  -0.60898 -2.851418 3.599161
O  0.627132 -1.558792 1.362079
O  1.1378 -4.275566 2.112624
O  3.350355 -0.61409 1.531446
O  1.890148 0.456576 2.845703
C  -3.961534 2.799285 -2.728797
C  -3.425032 3.69224 -3.66321
C  -5.334046 2.815818 -2.462421
C  -5.618425 4.612488 -4.047961
C  -0.053581 -0.590233 -4.533605
C  -3.067804 1.819179 -2.042152
C  -4.251932 4.595026 -4.322401
C  -6.15869 3.724419 -3.118159
C  6.817952 1.462738 -3.066376
C  4.224612 2.14958 -3.819851
C  4.432401 1.18488 -2.828598
C  5.307904 2.785222 -4.414782
C  3.259992 0.601383 -2.110547
C  6.603584 2.451431 -4.02611
C  5.734148 0.825661 -2.471042
C  -1.133096 -5.543057 -0.749578
C  2.556452 -3.470184 -2.635882
C  -5.486327 2.348603 2.592107
C  -4.218563 2.063996 3.106362
C  -3.274021 1.192414 2.347633
C  -3.707754 -2.679341 -2.625488
C  -3.891582 -3.273822 1.603884
C  -3.815737 2.632253 4.320257
C  2.367418 -4.096351 1.949602
C  5.013233 2.149024 5.030776
C  4.179227 0.612897 3.363276
C  5.456496 0.059015 3.236464
C  6.506245 0.544092 4.01078
C  -0.404902 -1.842492 4.315602
C  3.959565 1.6564 4.266981
C  3.050933 0.11354 2.522838
C  6.285564 1.591127 4.905657
C  -5.924363 3.78605 4.479229
C  -6.334795 3.213935 3.276031
C  -4.669123 3.487761 5.007362
H  -5.737874 2.103177 -1.738587
H  -7.231844 3.738553 -2.907833
H  -2.352433 3.652312 -3.870797
H  -2.15279 -0.507814 -2.889214
H  -3.831601 5.286521 -5.058171
H  7.838278 1.190657 -2.780609
H  5.144329 3.543994 -5.18535
H  3.198027 2.393066 -4.107857
H  5.87629 0.054868 -1.708338
H  1.893878 1.347018 0.384234
H  -5.786104 1.888158 1.647079
H  1.187206 -4.218944 -0.459965
H  -2.381856 -1.272122 2.589261
H  -2.822947 2.390263 4.710118
H  5.608081 -0.756052 2.522977
H  2.951468 2.072713 4.347739
H  4.842935 2.970278 5.732953
H  7.503229 0.103488 3.918826
H  -7.322968 3.445946 2.868878
H  -4.355166 3.928069 5.957986
H  7.458062 2.956959 -4.48616
H  -6.270236 5.322468 -4.56584
H  7.111948 1.974489 5.511797
H  -6.593461 4.466313 5.014735
H  0.094123 -0.461774 -5.630386
H  -0.3360 -2.025702 5.412221
H  3.042444 -4.769517 2.526075
H  -4.780661 -3.841907 1.961633
H  3.283454 -3.974972 -3.312604
H  -4.556553 -3.119295 -3.197395
H  -1.411926 -6.609297 -0.911677
C  -0.096521 3.646285 1.77474
H  0.245665 3.959563 0.550019
C  -1.560504 4.016049 1.7532
H  -1.976897 3.835281 2.758388
H  -1.722285 5.073688 1.497283
H  -2.112733 3.375261 1.045376
C  0.801647 4.597879 2.532183
H  0.645638 5.646832 2.229857
H  0.564716 4.514581 3.607248
H  1.854247 4.310648 2.389869
O  0.183487 2.390713 1.926888
C  2.977303 4.175868 -1.241197
C  1.707233 4.903297 -0.84791
H  2.762213 3.489616 -2.081372
H  3.74588 4.8748 -1.606746
H  1.83729 5.456599 0.098977
H  1.518796 5.680876 -1.610439
C  -0.808673 4.819195 -1.16551
H  -1.722371 4.245175 -0.963923
H  -0.852289 5.794318 -0.653884
H  -0.769474 5.002821 -2.253674
C  5.533061 2.25798 0.554752
H  6.577383 2.188453 0.227728
H  5.479725 2.647099 1.584622
H  5.055471 1.263842 0.534744
C  0.43376 4.04604 -0.790866
O  0.524534 2.832464 -1.200039
C  3.583583 3.316136 -0.178266
O  2.968015 2.799934 0.731358
O  4.885939 3.143441 -0.354629
