program: Gaussian 16
title: Title Card Required
version: ES64L-G16RevC.01
frameworkgroup: C1[X(C38H41O34PZr6)]
method: RM06
basis: Gen
operation: Freq
keyword: #p
keyword: freq=noraman
keyword: gen
keyword: integral=grid=ultrafine
keyword: m06
keyword: pseudo=read
keyword: scf=(intrep,xqc,maxconventionalcycles=150)
title: #p freq=noraman gen integral=grid=ultrafine m06 pseudo=read scf=(intre
basis: NPDir=0 NMtPBC= 1 NCelOv= 1 NCel= 1 NClECP= 1 NCelD= 1
basis: NCelK= 1 NCelE2= 1 NClLst= 1 CellRange= 0.0.
basis: One-electron integrals computed using PRISM.
basis: One-electron integral symmetry used in STVInt
converged: YES YES NO YES
title: Mulliken charges:
elementType: Zr Zr Zr Zr Zr Zr O O O O O O O O O O O O O O O O O O O O O O O O O O O O O O C C C C C C C C C C C C C C C C C C C C C C C C C C C C C C C C C C C H H H H H H H H H H H H H H H H H H H H H H H H O H H H H H H H H P O O C H C H H H H H O C H H H
charge: 1.417418 1.409512 1.363045 1.468717 1.191468 1.447428 -0.588987 -0.417100 -0.403806 -0.410526 -0.800142 -0.401085 -0.805238 -0.591074 -0.401998 -0.419252 -0.402076 -0.421712 -0.404302 -0.415289 -0.412780 -0.586588 -0.402635 -0.809063 -0.608945 -0.404304 -0.400888 -0.400167 -0.380181 -0.398731 -0.402779 -0.401512 -0.806016 -0.427609 -0.401976 -0.403554 -0.014098 -0.045047 -0.010544 0.431764 -0.011341 0.424266 -0.022893 -0.001038 -0.007272 -0.011991 -0.041291 -0.010764 0.430970 -0.002548 -0.028240 0.423801 -0.046882 0.445078 -0.028772 -0.002369 -0.010023 -0.008426 -0.014865 0.421155 0.423570 0.424461 -0.017612 0.429890 -0.026886 0.425485 -0.055633 -0.008573 -0.012456 0.422019 -0.003414 0.047849 0.015813 0.257181 0.019232 0.049344 0.017623 0.019402 0.048794 0.040299 0.250631 0.047359 0.020198 0.051234 0.017369 0.299364 0.248488 0.048061 0.058136 0.016193 0.017191 0.022599 0.022440 0.020644 0.022779 -0.473801 0.219100 0.033049 0.033169 0.032820 0.032592 0.031917 0.032773 0.034195 1.068146 -0.545535 -0.536735 0.125512 0.137878 -0.174682 0.105924 0.082714 0.094844 0.074536 0.043511 -0.500989 0.136556 0.063641 0.069921 0.073969
chargesum: -0.00000
polarizability: 8.12021407e+02 -3.64924222e+00 6.62170025e+02 1.79463206e+00 -2.92605709e+00 6.68600874e+02
redmass: 9.3169 6.7011 10.5420 11.6029 14.0855 5.5201 4.7557 6.1397 7.4395 3.8128 4.1777 5.3788 6.0685 5.8504 7.4004 7.9621 9.1573 9.4181 8.3578 6.2205 7.0913 4.9393 7.1180 6.0589 4.0238 7.0675 5.8976 4.4922 4.9800 6.8532 7.0851 5.6322 3.8997 11.6863 6.1629 5.2635 7.9990 11.7943 9.5181 8.2234 8.5164 9.7350 9.7122 9.8921 9.9455 8.2442 11.6204 11.1067 11.8692 13.1966 10.9979 8.3222 19.3789 5.7453 7.4217 6.8046 5.0901 10.1600 2.2679 2.4126 5.9051 12.6686 6.7740 8.1776 2.0030 3.4843 9.2461 11.8770 11.8702 12.6181 2.7501 3.6482 3.6460 4.1155 3.4212 3.1147 6.2945 4.0695 4.1664 7.9967 7.7816 4.7157 4.6277 6.5598 5.3153 8.3027 7.4717 8.3115 7.6237 7.0616 8.7211 5.9888 7.9485 9.1106 9.0985 9.0491 9.1343 10.1313 9.8408 10.0925 10.6730 10.8280 10.7115 10.7818 7.2565 5.6863 4.5261 4.4238 4.3764 13.3952 5.9261 5.1479 7.7698 2.8986 6.0952 6.8827 3.1946 3.0044 3.1881 7.4955 8.2624 8.6214 8.2106 5.6243 6.7820 8.2797 7.0690 1.5826 7.1278 8.5179 5.6252 7.7420 9.1037 10.1052 11.2840 11.8502 8.7492 6.8263 7.9748 6.6245 6.6995 8.0737 9.2161 7.8357 7.9656 8.3648 9.0092 8.9180 9.1380 3.3836 3.3730 3.4209 3.5465 6.6373 9.2466 12.9378 7.6574 9.9588 1.3794 1.2646 1.2649 1.2980 1.2586 4.2474 2.7243 2.7938 4.4044 4.3871 3.3602 3.8440 11.2773 2.0904 3.4261 3.4010 6.5527 3.9905 3.5412 2.9585 3.2977 2.7844 1.7114 1.7308 2.3716 1.4081 1.6282 1.3446 1.4724 3.1281 1.8341 3.1993 2.8687 3.1225 1.2490 1.2479 1.2467 1.2458 6.4636 6.1993 6.0879 6.1049 1.7581 1.4303 1.4711 1.4706 1.4482 1.9679 1.1642 1.3045 1.2932 1.3069 1.3187 1.3449 1.3495 1.3467 1.3400 2.2112 2.2206 2.2318 2.2750 1.7180 1.7192 1.7226 1.7189 1.7264 1.7241 1.7300 1.1861 1.1860 1.1907 1.2001 5.3298 4.0296 1.1864 1.1722 1.1586 1.3044 1.1750 1.3193 1.1060 1.1137 1.1048 1.4539 1.1270 1.5889 3.1525 2.9945 3.1652 3.3295 8.9880 1.4900 1.4875 1.4529 1.3852 1.4768 1.0440 1.1057 1.0515 1.1085 1.1075 1.1074 1.1055 1.1041 1.1038 1.0519 1.0603 2.7978 3.4552 1.2167 3.5545 4.5597 6.0861 9.4251 9.5344 9.5532 1.1234 8.6009 8.5840 5.0595 2.2715 1.1915 2.7228 2.6030 1.0769 2.8711 6.9476 7.2326 8.3114 9.6354 6.5111 6.4378 6.4260 6.3957 10.5104 11.1230 10.8887 6.6601 6.9021 6.7674 6.8276 10.7101 11.4314 11.1881 11.4385 11.5892 11.7262 11.1935 11.1725 1.0860 1.0860 1.0860 1.0862 1.0863 1.0863 1.0871 1.0313 1.0328 1.0348 1.0079 1.0079 1.0079 1.0079 1.1083 1.1063 1.1092 1.1053 1.0889 1.0896 1.0891 1.0897 1.0893 1.0898 1.1057 1.1066 1.0897 1.0898 1.0970 1.0963 1.0961 1.0959 1.0957 1.0960 1.0954 1.0951 1.0665 1.0665 1.0665 1.0665 1.0661
temp: 298.150 k
press: 1.00000 atm
elementType: 40 40 40 40 40 40 8 8 8 8 8 8 8 8 8 8 8 8 8 8 8 8 8 8 8 8 8 8 8 8 8 8 8 8 8 8 6 6 6 6 6 6 6 6 6 6 6 6 6 6 6 6 6 6 6 6 6 6 6 6 6 6 6 6 6 6 6 6 6 6 6 1 1 1 1 1 1 1 1 1 1 1 1 1 1 1 1 1 1 1 1 1 1 1 1 8 1 1 1 1 1 1 1 1 15 8 8 6 1 6 1 1 1 1 1 8 6 1 1 1
symmnumber: 1
zpe: 2111787.1 jmol-1
zpe.correction: 0.804337 hartree
zpe.thermalcorrener: 0.884608 hartree
zpe.thermalcorrenthalpy: 0.885552 hartree
zpe.thermalcorrgfe: 0.694927 hartree
zpe.sumelectzpe: -4650.196282 hartree
zpe.sumelectthermal: -4650.116011 hartree
zpe.sumelectthermalent: -4650.115067 hartree
zpe.sumelectthermalfe: -4650.305692 hartree
dipole: 0.8956 10.0733 0.8956
dipole: 10.1526
quadrupole: -498.8826 -503.4686 -527.2848
quadrupole: 4.4171 -3.0018 -0.1586
quadrupole: 10.9961 6.4101 -17.4061 4.4171 -3.0018 -0.1586
hfenergy: -4651.0006194 hartree
pointgroup: C01 [X(C38H41O34P1Zr6)]
dipole: 0.3523456 3.9631538 0.3523655 debye
polarizability: 812.0214074|-3.6492354|662.1700251|1.7946322|-2.926057|668.6008736 unknown
InChI: InChI=1S/4C7H5O2.C3H9O3P.7CHO2.H2O.4HO.4O.6Zr/c4*8-7(9)6-4-2-1-3-5-6;1-5-7(3,4)6-2;7*2-1-3;;;;;;;;;;;;;;;/h4*1-5H;1-3H3;7*1H;1H2;4*1H;;;;;;;;;;/q4*-2;-1;7*-2;;;;;;;;;;6*+4/p-1
charge 0 multiplicity 1
120 atoms
Zr -2.635746 -0.90486 -0.214194
Zr 2.362095 -1.239521 -0.240936
Zr -0.015712 1.069174 -1.489212
Zr -0.233349 -2.334579 -2.411185
Zr -0.043913 0.177139 1.985748
Zr -0.258259 -3.246636 1.006552
O  -1.523187 -0.479833 -2.149611
O  -3.60755 0.869795 -1.162895
O  -2.247832 -2.780712 -3.280969
O  -1.938457 2.129063 -1.963612
O  -1.108248 0.448038 0.161507
O  -3.771706 -1.885904 -1.891434
O  -1.268259 -2.429226 -0.619236
O  -1.563725 -1.510984 1.684992
O  -3.795044 -2.599585 0.700875
O  -3.678505 0.142432 1.450802
O  -2.290267 -4.071249 1.489985
O  -2.054169 0.823242 2.831962
O  -0.444332 -4.558522 -2.35284
O  2.034092 1.779802 -2.135292
O  3.522632 0.350316 -1.272707
O  1.139178 -3.101121 -0.78242
O  0.014217 1.013538 -3.736368
O  0.911666 -0.767588 -1.665291
O  1.344492 0.791554 0.300931
O  1.700031 -2.91715 -3.376502
O  -0.115657 -1.154607 -4.313457
O  3.345555 -2.236321 -2.003758
O  2.035334 0.275695 2.892007
O  -0.465645 -5.14392 -0.183131
O  1.648418 -4.278519 1.561689
O  3.321351 -3.007613 0.760484
O  0.902305 -1.55657 1.15896
O  3.56087 -0.391643 1.401916
O  -0.100242 -1.04215 3.870216
O  -0.183795 -3.19845 3.240069
C  -5.517657 2.687491 -2.081507
C  -4.14621 2.886655 -2.269293
C  -4.616843 4.921747 -3.489583
C  -3.157754 1.892029 -1.751009
C  -6.432228 3.600917 -2.597622
C  -3.416756 -2.558699 -2.886059
C  -3.700739 4.010657 -2.973713
C  -5.983906 4.716616 -3.304852
C  -4.744205 2.677801 5.363738
C  -5.612105 1.448318 3.009058
C  -4.2572 1.429568 3.350744
C  -6.527855 2.082294 3.84284
C  -3.258048 0.749903 2.47448
C  -6.093725 2.694494 5.018327
C  -3.827924 2.047048 4.531011
C  -3.452546 -3.681053 1.232669
C  4.317309 2.176474 -2.531943
C  3.208086 1.368954 -1.941333
C  4.030311 3.198577 -3.443463
C  6.380804 3.704065 -3.615588
C  6.671704 2.683492 -2.711654
C  5.643053 1.91621 -2.174356
C  5.06092 3.959447 -3.985732
C  -0.553887 -5.377881 -1.409481
C  0.016959 0.066685 -4.557332
C  2.900323 -2.737405 -3.061117
C  5.640751 0.491337 3.070863
C  3.214048 0.114216 2.510872
C  3.93939 1.202251 4.63801
C  2.854212 -3.973483 1.407101
C  4.293243 0.600072 3.425072
C  4.923825 1.694729 5.487307
C  6.624891 0.985232 3.923088
C  -0.086431 -2.275835 4.083242
C  6.267033 1.587694 5.129243
H  -2.625317 4.146942 -3.115552
H  -4.26459 5.79588 -4.044832
H  -2.073669 -0.236212 -2.901382
H  -7.504219 3.440279 -2.451791
H  -5.849652 1.802758 -1.531729
H  -4.407743 3.154786 6.288577
H  -7.588799 2.098253 3.577835
H  -5.928801 0.957341 2.084986
H  -2.766001 2.011734 4.787787
H  -2.130586 -1.685884 2.443666
H  2.987995 3.36997 -3.729102
H  7.708699 2.483319 -2.427622
H  5.846717 1.106051 -1.469222
H  4.83741 4.751736 -4.706028
H  1.918558 1.543257 0.515067
H  1.643181 -3.894068 -0.993709
H  5.898156 0.015935 2.120395
H  2.878276 1.276625 4.891884
H  4.644782 2.163891 6.435206
H  7.679751 0.899868 3.646587
H  -6.818032 3.189057 5.672654
H  -6.704896 5.430632 -3.713848
H  7.043249 1.974768 5.79633
H  7.191677 4.303154 -4.040756
O  0.162722 2.144692 2.484244
H  -0.587276 2.449818 3.006244
H  0.007402 -2.592506 5.147253
H  0.13733 0.344153 -5.629569
H  3.597333 -4.648609 1.889776
H  3.658274 -3.075349 -3.804442
H  -4.278578 -4.370337 1.522431
H  -4.23451 -3.000442 -3.500298
H  -0.738392 -6.437646 -1.698839
P  1.035839 4.137042 -0.013945
O  0.19154 3.149189 -0.773889
O  2.259469 3.434538 0.743504
C  2.704433 3.761782 2.066437
H  2.001776 3.322007 2.791153
C  1.808351 5.35315 -1.058954
H  1.045112 5.882076 -1.646518
H  2.365488 6.07189 -0.439926
H  2.503826 4.829909 -1.733858
H  3.704067 3.319436 2.179877
H  2.773365 4.854394 2.194407
O  0.183968 4.962094 1.046924
C  -1.190603 4.667165 1.31438
H  -1.432948 5.130864 2.279359
H  -1.829704 5.100112 0.529324
H  -1.358797 3.580982 1.371921
