program: Gaussian 16
title: Title Card Required
version: ES64L-G16RevC.01
frameworkgroup: C1[X(C77H60O31Zr6)]
method: RM06
basis: Gen
operation: FOpt
keyword: #pM06
keyword: integral=grid=ultrafine
keyword: gen
keyword: pseudo=read
keyword: scf=(intrep,xqc,maxconventionalcycles=150)
keyword: opt
title: #p M06 integral=grid=ultrafine gen pseudo=read scf=(intrep,xqc,maxconv
basis: NPDir=0 NMtPBC= 1 NCelOv= 1 NCel= 1 NClECP= 1 NCelD= 1
basis: NCelK= 1 NCelE2= 1 NClLst= 1 CellRange= 0.0.
basis: One-electron integrals computed using PRISM.
basis: One-electron integral symmetry used in STVInt
converged: YES YES YES YES
title: Mulliken charges:
elementType: Zr Zr Zr Zr Zr Zr O O O O O O O O O O O O O O O O O O O O O O O O O O O O O O C C C C C C C C C C C C C C C C C C C C C C C C C C C C C C C C C C C C C C C C C C C C C C C C C C C C C C C C C C C C C C C C C C C C C C C C C C C C C H H H H H H H H H H H H H H H H H H H H H H H H H H H H H H H H H H H H H H H H H H H H H H H H H H H H H H H H H H H O H
charge: 1.453847 1.439749 1.448091 1.426970 1.204900 1.418565 -0.590893 -0.406208 -0.425176 -0.448723 -0.795359 -0.421556 -0.805199 -0.594196 -0.421130 -0.427485 -0.419957 -0.411814 -0.432158 -0.445778 -0.404197 -0.588149 -0.424238 -0.799463 -0.584694 -0.424263 -0.416379 -0.421662 -0.379880 -0.411677 -0.420732 -0.421974 -0.802896 -0.444863 -0.416200 -0.424537 -0.013790 -0.042573 -0.013679 -0.013611 -0.001061 -0.043205 -0.015001 0.458118 -0.009497 0.455896 -0.013809 0.002073 -0.009670 -0.009037 -0.005161 -0.012695 -0.041984 -0.010898 -0.010717 0.436532 -0.000397 -0.002917 -0.014457 -0.014896 -0.011306 -0.020700 0.453466 -0.042146 -0.042116 0.455968 -0.012255 0.001095 -0.009518 -0.011721 -0.013258 -0.012721 -0.043178 0.457710 -0.000903 0.443708 -0.009479 -0.000871 -0.008654 -0.010678 -0.013859 -0.010530 -0.014319 -0.042833 -0.009558 0.457099 -0.010066 -0.049441 -0.013791 -0.010028 -0.014557 0.446505 -0.011708 -0.009196 -0.000722 -0.047839 -0.010443 -0.009770 -0.010200 0.455230 -0.010774 -0.045194 -0.009179 -0.013740 0.444751 -0.014297 -0.013102 -0.002096 -0.042831 -0.001107 -0.000959 -0.009044 -0.009964 0.046330 0.042697 0.016463 0.019278 0.045994 0.263943 0.016723 0.018185 0.049820 0.017362 0.015943 0.016002 0.015515 0.045512 0.043427 0.048521 0.046109 0.257023 0.040899 0.017465 0.050402 0.017840 0.045917 0.016106 0.045798 0.017377 0.017381 0.046026 0.045846 0.016694 0.046967 0.290681 0.258016 0.040657 0.046841 0.047831 0.055239 0.015986 0.046636 0.014826 0.047321 0.045020 0.015144 0.013299 0.016279 0.016178 0.016080 0.016893 0.020700 0.020838 0.021553 0.020167 0.021365 0.023647 0.020926 0.022091 0.021349 0.018401 0.022514 -0.434861 0.229691
chargesum: -0.00000
dipole: -0.8458 -2.5012 1.9877
dipole: 3.3049
quadrupole: -658.8064 -663.6481 -683.6433
quadrupole: -1.4793 5.9302 7.9223
quadrupole: 9.8929 5.0511 -14.9441 -1.4793 5.9302 7.9223
hfenergy: -5579.714707 hartree
pointgroup: C01 [X(C77H60O31Zr6)]
dipole: -0.3327764 -0.9840408 0.7820163 debye
InChI: InChI=1S/11C7H5O2.H2O.4HO.4O.6Zr/c11*8-7(9)6-4-2-1-3-5-6;;;;;;;;;;;;;;;/h11*1-5H;1H2;4*1H;;;;;;;;;;/q11*-2;;;;;;;;;;+3;5*+4/p-1
charge 0 multiplicity 1
174 atoms
Zr -2.480613 -0.301805 -0.400061
Zr 2.494963 0.297144 -0.33628
Zr 0.23831 -1.729595 -2.057873
Zr 0.179124 -1.801058 1.426196
Zr -0.200092 1.835001 -2.158897
Zr -0.211703 1.713036 1.423455
O  -1.167675 -2.167042 -0.399099
O  -3.274755 -1.77316 -1.922051
O  -1.711828 -2.730155 2.137616
O  -1.543433 -2.552764 -3.114046
O  -1.026666 -0.119888 -1.866521
O  -3.394199 -1.816693 0.973294
O  -1.038637 -0.171765 1.092065
O  -1.628058 1.78441 -0.344438
O  -3.69093 0.872391 1.072862
O  -3.742074 0.903475 -1.768736
O  -2.266925 2.171489 2.211261
O  -2.303391 2.223957 -2.862305
O  0.030263 -1.202912 3.539094
O  2.187859 -2.244647 -2.993759
O  3.618347 -1.068769 -1.733108
O  1.379158 0.104332 1.659611
O  0.538345 -3.855683 -1.496543
O  1.201808 -1.361818 -0.352474
O  1.342513 0.175102 -2.438527
O  2.23248 -2.357463 2.096601
O  0.488888 -3.91265 0.740364
O  3.684114 -1.049929 0.998128
O  1.769741 2.894697 -2.527879
O  -0.22748 1.021193 3.570575
O  1.637172 2.698588 2.185914
O  3.358225 1.794038 1.074398
O  0.885486 1.527199 -0.315252
O  3.471005 1.75058 -1.642809
O  -0.458798 3.919037 -1.418735
O  -0.400067 3.848913 0.817963
C  -5.121915 -3.196311 -3.370339
C  -3.906369 -3.450861 2.596925
C  -5.274332 -3.368534 2.318186
C  -3.448254 -4.355488 3.560559
C  -5.711047 -5.094344 3.94625
C  -3.751036 -3.293767 -3.64357
C  -4.236095 -4.97965 -5.311901
C  -2.787202 -2.470716 -2.846037
C  -6.039184 -3.984242 -4.058514
C  -2.93552 -2.595019 1.854301
C  -3.315181 -4.189624 -4.625578
C  -5.600964 -4.884924 -5.029591
C  -6.173396 -4.188899 2.991558
C  -4.348878 -5.174826 4.232571
C  -5.302362 4.05953 -5.006673
C  -5.889502 1.979731 -3.233058
C  -4.572145 2.416881 -3.391797
C  -6.909191 2.581423 -3.962961
C  -6.946369 2.424172 3.171395
C  -3.458741 1.796259 -2.61937
C  -6.72429 3.41558 4.127603
C  -6.613524 3.619063 -4.846401
C  -5.875515 1.873153 2.473605
C  -4.350596 3.298159 3.690222
C  -5.423223 3.848516 4.386346
C  -4.282738 3.458076 -4.280683
C  -3.423243 1.736246 1.953792
C  -4.569937 2.308554 2.725973
C  4.526084 -2.520495 -3.339736
C  3.361557 -1.90198 -2.635915
C  4.344457 -3.479718 -4.341166
C  6.740629 -3.647092 -4.629607
C  6.925013 -2.69137 -3.630799
C  5.824994 -2.131882 -2.989117
C  5.447672 -4.039008 -4.981734
C  -0.073901 -1.362382 6.297378
C  -0.194686 -0.140516 5.627132
C  -0.136217 -0.098998 4.136782
C  6.636164 -3.82667 3.924803
C  0.61125 -4.460313 -0.388662
C  0.888919 -6.676968 0.749141
C  1.171816 -8.696168 -0.538734
C  1.115804 -7.959084 -1.720439
C  0.943282 -6.580752 -1.668877
C  5.849494 -2.224082 2.300329
C  1.06154 -8.055941 0.695135
C  4.274866 -3.642012 3.465204
C  4.531433 -2.628998 2.534994
C  5.324108 -4.238059 4.157131
C  3.401004 -1.968714 1.815877
C  6.897431 -2.821359 2.99378
C  0.825485 -5.934358 -0.434012
C  -0.350894 1.039873 6.360715
C  4.204286 5.168073 4.350031
C  5.324028 3.465817 -2.896846
C  2.987616 2.69062 -2.352963
C  -0.808427 8.001635 1.024696
C  3.43481 4.581162 -3.914949
C  5.576755 5.079431 4.118654
C  -0.601401 5.951346 -0.23842
C  -0.688906 6.681382 -1.428683
C  -0.838609 8.063773 -1.390524
C  6.066016 4.193424 3.158714
C  2.865352 2.5982 1.914383
C  -0.658291 6.618966 0.988986
C  3.941914 3.598077 -3.057713
C  4.30014 5.42171 -4.606006
C  6.188576 4.309602 -3.58889
C  -0.467394 4.465107 -0.283358
C  5.186694 3.393731 2.43547
C  3.323178 4.369454 3.628151
C  5.678154 5.28613 -4.44519
C  3.809993 3.474971 2.668852
C  -0.901419 8.724876 -0.164434
C  -0.253084 -0.22271 8.41476
C  -0.102922 -1.40256 7.687131
C  -0.379669 0.997321 7.750952
H  -2.376164 -4.403913 3.767576
H  -2.244821 -4.26453 -4.836828
H  -3.98797 -5.882759 4.984035
H  -3.884288 -5.680805 -6.074203
H  -5.615099 -2.653765 1.564644
H  -1.636017 -3.008574 -0.4218
H  -7.242663 -4.124492 2.770924
H  -7.10579 -3.898016 -3.832233
H  -5.452846 -2.493647 -2.60169
H  -5.076874 4.875092 -5.699363
H  -5.243985 4.623889 5.136756
H  -7.94224 2.242659 -3.84383
H  -7.964108 2.079498 2.966798
H  -6.033168 1.098322 1.718857
H  -6.094695 1.166632 -2.531616
H  -3.245893 3.787206 -4.383609
H  -3.3258 3.628664 3.879186
H  -2.272681 2.49967 -0.320513
H  3.327333 -3.779601 -4.607691
H  7.935089 -2.3798 -3.349986
H  5.953013 -1.382233 -2.20436
H  5.29841 -4.788781 -5.764015
H  3.239698 -3.94845 3.635873
H  5.118747 -5.028179 4.884982
H  0.045784 -2.275101 5.708285
H  1.206054 -8.463918 -2.686351
H  1.109096 -8.637887 1.619865
H  6.033577 -1.432217 1.569561
H  0.797182 -6.15355 1.704463
H  7.926581 -2.50022 2.809509
H  0.894047 -5.98213 -2.5818
H  1.849272 0.303794 -3.250762
H  1.922024 0.159307 2.453254
H  5.705379 2.691063 -2.226004
H  -0.445582 1.985513 5.820536
H  -0.638363 6.143024 -2.378688
H  2.351025 4.661645 -4.030896
H  3.819401 5.86489 5.100073
H  2.244502 4.422743 3.79664
H  3.898949 6.185961 -5.277755
H  5.551052 2.692138 1.680539
H  -0.585396 6.033604 1.909336
H  -0.854581 8.521112 1.986126
H  7.270115 4.204789 -3.462801
H  7.141961 4.125895 2.974237
H  -0.907725 8.631289 -2.32294
H  -0.006352 -2.359216 8.208334
H  -0.500153 1.921631 8.323058
H  -7.566416 3.850529 4.6738
H  -7.419584 4.090402 -5.417156
H  -6.419124 -5.740661 4.473519
H  -1.021147 9.812033 -0.134782
H  -0.27385 -0.253902 9.508238
H  -6.318696 -5.509828 -5.56856
H  6.269426 5.706412 4.687922
H  1.305361 -9.781437 -0.578844
H  7.460981 -4.293729 4.471161
H  6.360998 5.945267 -4.989709
H  7.604176 -4.088484 -5.135539
O  -0.045202 1.753288 -4.155453
H  -0.842723 1.803604 -4.690734
