program: Gaussian 16
title: Title Card Required
version: ES64L-G16RevC.01
frameworkgroup: C1[X(C3H6O)]
method: RM06
basis: Gen
operation: Freq
keyword: #p
keyword: freq=noraman
keyword: gen
keyword: integral=grid=ultrafine
keyword: m06
keyword: scf=(intrep,xqc,maxconventionalcycles=150)
title: #p freq=noraman gen integral=grid=ultrafine m06 scf=(intrep,xqc,maxcon
basis: NPDir=0 NMtPBC= 1 NCelOv= 1 NCel= 1 NClECP= 1 NCelD= 1
basis: NCelK= 1 NCelE2= 1 NClLst= 1 CellRange= 0.0.
basis: One-electron integrals computed using PRISM.
basis: One-electron integral symmetry used in STVInt
basis: NBasis= 86 RedAO= T EigKep= 3.41D-03 NBF= 86
basis: NBsUse= 86 1.00D-06 EigRej= -1.00D+00 NBFU= 86
converged: YES YES NO NO
title: Mulliken charges:
elementType: C O C H H H C H H H
charge: 0.011311 -0.237051 -0.074057 0.063823 0.058034 0.065071 -0.074058 0.058030 0.065074 0.063822
chargesum: -0.00000
title: Mulliken charges with hydrogens summed into heavy atoms:
elementType: C O C C
charge: 0.011311 -0.237051 0.112871 0.112869
chargesum: 0.00000
polarizability: 3.71656364e+01 -1.34631095e-05 3.88346303e+01 -1.66795876e-02 -6.18289905e-05 2.75855634e+01
1716.lowfreq: -6.4190 -6.0615 0.0006 0.0008 0.0009 8.1848 51.3147 142.8693 381.4622
frequency: 50.6006 142.8650 381.4622 482.5174 539.2994 813.8632 840.6701 872.4333 1054.0621 1090.9468 1225.7860 1334.4938 1368.0679 1391.4365 1399.8182 1403.8831 1423.0792 1876.5228 3021.8129 3025.5902 3117.1025 3121.8019 3167.1907 3167.4803
redmass: 1.0170 1.1368 2.1007 1.8472 3.2603 2.8039 1.2684 1.5097 1.6180 2.1105 1.8727 1.2771 2.0103 1.0494 1.0496 1.0582 1.0517 11.0830 1.0383 1.0384 1.1008 1.1010 1.1061 1.1063
irintensity: 0.0291 0.2561 0.9606 0.6108 15.3890 1.1787 0.0000 2.5080 0.1007 7.4648 40.4786 21.9017 112.9567 0.2832 7.7037 14.5860 24.4536 194.5613 1.8902 3.7463 0.3028 9.5523 6.2261 3.4246
temp: 298.150 k
press: 1.00000 atm
elementType: 6 8 6 1 1 1 6 1 1 1
symmnumber: 1
zpe: 217198.7 jmol-1
zpe.correction: 0.082727 hartree
zpe.thermalcorrener: 0.088131 hartree
zpe.thermalcorrenthalpy: 0.089076 hartree
zpe.thermalcorrgfe: 0.054438 hartree
zpe.sumelectzpe: -192.796024 hartree
zpe.sumelectthermal: -192.790619 hartree
zpe.sumelectthermalent: -192.789675 hartree
zpe.sumelectthermalfe: -192.824312 hartree
dipole: 0.0000 -2.9385 0.0000
dipole: 2.9385
quadrupole: -23.6074 -28.3656 -23.9060
quadrupole: 0.0000 -0.0899 -0.0000
quadrupole: 1.6856 -3.0726 1.3870 0.0000 -0.0899 -0.0000
hfenergy: -192.8787503 hartree
pointgroup: C01 [X(C3H6O1)]
dipole: 0.0000014 -1.156086 0.0000102 debye
dipolederiv: 1.1618686 -0.0000039 -0.0134969 0.0000006 1.2455978 -0.000007 -0.0072872 -0.0000085 0.1474628 -0.6185056 0.0000019 -0.0025625 -0.0000012 -1.0984008 0.000002 -0.0086995 0.000002 -0.3041777 -0.3386952 0.1939777 0.0111389 0.1534501 -0.1635961 -0.0104272 0.0219496 -0.0243857 0.0118299 -0.0417724 -0.022915 -0.007736 -0.0796253 0.0161701 -0.0084766 -0.0124421 -0.0013988 0.0851329 0.0520614 -0.0083491 0.0425889 0.0050631 0.0213437 0.0773129 -0.0102942 0.097425 0.0028128 0.0567262 0.0086441 -0.0379655 0.0156045 0.0524833 -0.0665778 0.0087805 -0.0786899 -0.0214167 -0.3387034 -0.1939751 0.0111491 -0.1534439 -0.1635891 0.0104337 0.021963 0.0244086 0.011826 0.0520577 0.0083573 0.042588 -0.0050607 0.0213248 -0.0773155 -0.0102956 -0.0974303 0.0028257 0.0567328 -0.0086524 -0.0379613 -0.015611 0.0524971 0.0665693 0.0087815 0.0786773 -0.0214272 -0.0417701 0.0229146 -0.0077426 0.0796239 0.0161694 0.0084863 -0.012456 0.0014003 0.0851315 unknown
polarizability: 37.1656364|-0.0000145|38.8346303|-0.0166796|-0.0000618|27.5855634 unknown
InChI: InChI=1S/C3H6O/c1-3(2)4/h1-2H3
charge 0 multiplicity 1
10 atoms
C  0.000001 0.189228 -0.000001
O  -0.000003 1.396282 0.0000
C  1.275864 -0.6123 0.002017
H  2.141407 0.056511 0.097709
H  1.276246 -1.349459 0.821641
H  1.359961 -1.186051 -0.936271
C  -1.275861 -0.612305 -0.002018
H  -1.276207 -1.349534 -0.821577
H  -1.360013 -1.185964 0.936318
H  -2.141398 0.0565 -0.097812
