program: Gaussian 16
title: Title Card Required
version: ES64L-G16RevC.01
frameworkgroup: C*V[C*(HO)]
method: UB3LYP
basis: Aug-CC-pVTZ
operation: Freq
keyword: #P
keyword: Geom=AllCheck
keyword: Guess=TCheck
keyword: SCRF=Check
keyword: GenChk
keyword: UB3LYP/Aug-CC-pVTZ
keyword: Freq
converged: YES YES YES YES
polarizability: 6.08145603e+00 0.00000000e+00 7.60664035e+00 6.88442301e-14 0.00000000e+00 8.83982018e+00
1716.lowfreq: -9.4656 -0.0015 -0.0011 0.0016 22.8764 3693.0919
frequency: 3693.0919
redmass: 1.0671
irintensity: 13.3270
temp: 298.150 k
press: 1.00000 atm
elementType: 8 1
symmnumber: 1
zpe: 22089.6 jmol-1
zpe.correction: 0.008413 hartree
zpe.thermalcorrener: 0.010774 hartree
zpe.thermalcorrenthalpy: 0.011718 hartree
zpe.thermalcorrgfe: -0.008514 hartree
zpe.sumelectzpe: -75.760185 hartree
zpe.sumelectthermal: -75.757825 hartree
zpe.sumelectthermalent: -75.756881 hartree
zpe.sumelectthermalfe: -75.777113 hartree
hfenergy: -75.7685987 hartree
pointgroup: C*V [C*(H1O1)]
dipole: 0. 0. -0.6490277 debye
dipolederiv: -0.3520905 0. 0. 0. -0.3521436 0. 0. 0. -0.1138451 0.3520905 0. 0. 0. 0.3521436 0. 0. 0. 0.1138451 unknown
polarizability: 6.081456|0.|7.6066403|0.|0.|8.8398202 unknown
InChI: InChI=1S/HO/h1H
charge 0 multiplicity 2
2 atoms
O  0.0000 0.0000 0.10509144
H  0.0000 0.0000 -0.87021444
