program: Gaussian 16
title: Title Card Required
version: ES64L-G16RevC.01
frameworkgroup: C1[X(C6H7)]
method: UB3LYP
basis: Aug-CC-pVTZ
operation: Freq
keyword: #P
keyword: Geom=AllCheck
keyword: Guess=TCheck
keyword: SCRF=Check
keyword: GenChk
keyword: UB3LYP/Aug-CC-pVTZ
keyword: Freq
converged: YES YES YES YES
polarizability: 7.63101349e+01 -5.04604104e-02 7.37519491e+01 3.75656405e-04 4.12463267e-06 3.88748269e+01
1716.lowfreq: -0.0010 -0.0009 -0.0002 7.9107 10.1407 10.7363 216.8003 333.5313 419.4262
frequency: 216.8002 333.5312 419.4261 590.5878 597.3476 663.6294 808.2068 852.5292 899.8658 990.2588 1007.6768 1016.4912 1017.7544 1052.8986 1077.7453 1150.1002 1152.5494 1205.6648 1213.0583 1276.6647 1367.2821 1420.2123 1482.7236 1485.4747 1573.5498 1640.2157 2942.3477 2949.4706 3179.2558 3188.9598 3190.0235 3207.5216 3209.8510
redmass: 1.3611 2.6256 2.1778 6.2238 5.8399 1.3366 1.1589 1.7687 4.0401 1.5720 6.3504 2.4972 1.2276 1.3952 1.4794 1.2171 1.2415 1.1338 1.1450 1.0623 1.4524 2.4234 1.6561 4.1512 2.9986 4.8458 1.0853 1.0667 1.0913 1.0900 1.0926 1.0957 1.0983
irintensity: 11.9167 0.0000 1.5201 5.3051 0.0194 54.5655 0.0000 15.6576 13.9960 16.4025 0.6031 0.1777 0.0000 0.0152 2.6513 0.4443 0.0000 18.0842 24.3472 111.3252 14.7055 3.7871 26.3137 178.2893 1.9006 75.2878 24.2592 62.4077 0.1489 2.4665 5.2142 6.3039 1.6852
temp: 298.150 k
press: 1.00000 atm
elementType: 6 6 6 6 6 1 1 1 1 1 6 1 1
symmnumber: 1
zpe: 289374.7 jmol-1
zpe.correction: 0.110217 hartree
zpe.thermalcorrener: 0.115222 hartree
zpe.thermalcorrenthalpy: 0.116167 hartree
zpe.thermalcorrgfe: 0.082189 hartree
zpe.sumelectzpe: -232.525489 hartree
zpe.sumelectthermal: -232.520483 hartree
zpe.sumelectthermalent: -232.519539 hartree
zpe.sumelectthermalfe: -232.553517 hartree
hfenergy: -232.6357057 hartree
pointgroup: C01 [X(C6H7)]
dipole: 0.330044 -0.0066576 0.000091 debye
dipolederiv: -0.4359062 0.7433933 -0.0000059 0.3120751 -0.270068 0.0000049 0.0000064 -0.0000208 -0.0459149 0.504017 -0.4660208 0.0000354 0.1317969 0.0175929 0.0000368 0.0000469 0.0000025 0.0438978 0.5166249 0.4459902 0.0000342 -0.1518187 0.0050439 -0.0000384 0.0000469 -0.000005 0.0438859 -0.4778968 -0.7350559 -0.0000063 -0.3037585 -0.2280945 -0.0000044 0.0000074 0.0000213 -0.0459482 0.4611557 0.0066882 -0.0000035 0.0067285 0.795851 0. -0.0000136 0.0000004 0.1156057 0.0867275 -0.003394 0.0000003 -0.0065875 0.0734162 -0.0000005 -0.0000034 0.0000022 0.1482396 0.094694 -0.0098942 -0.0000038 0.0009239 0.0892814 -0.0000004 -0.0000003 -0.0000009 0.1098667 0.0950763 0.0096965 -0.0000039 -0.0011512 0.0889661 0.0000005 -0.0000003 0.0000007 0.1098888 0.0870737 0.0028726 0.0000003 0.0060433 0.0730034 0.0000004 -0.0000036 -0.0000022 0.1482325 0.0889616 0.0004358 -0.0000015 0.0004351 0.1103002 0. 0.0000085 -0.0000003 0.101249 -0.5834878 0.0109288 -0.0000787 0.0109585 -0.0363032 0.0000014 -0.0002447 0.0000046 -0.0362881 0.2814659 -0.0028203 0.0003436 -0.0028231 0.1404848 -0.0000076 0.0204643 -0.000412 0.1536393 0.2814941 -0.0028201 -0.0003104 -0.0028222 0.1405258 0.0000071 -0.0203147 0.0004093 0.153646 unknown
polarizability: 76.3101412|-0.0503006|73.7519428|0.0003757|0.0000041|38.8748269 unknown
InChI: InChI=1S/C6H7/c1-2-4-6-5-3-1/h1-5H,6H2
charge 1 multiplicity 1
13 atoms
C  -0.762757 -1.220869 -0.000002
C  0.601415 -1.262271 -0.000032
C  0.651572 1.237238 -0.000032
C  -0.713176 1.250376 -0.000001
C  -1.409252 0.028207 0.000003
H  -1.348794 -2.128619 0.000006
H  1.130651 -2.206549 -0.000058
H  1.21806 2.159652 -0.000059
H  -1.262515 2.180795 0.000008
H  -2.492608 0.049949 0.000055
C  1.390709 -0.027841 0.000011
H  2.102255 -0.04214 -0.84592
H  2.101882 -0.042129 0.846284
